[elinks-users] Can't compile eLinks Debian (PowerMac; Kernel 2.4.22)

Phillip Pi ant at zimage.com
Tue Jan 31 06:47:20 PST 2006


> > > > > > > > > > > Hello, I just downloaded and tried to compile eLinks v0.11.1 but make failed:
> > > > > > > > I must say, I do not have any idea what is wrong, but if you have time
> > > > > > > > to debug here are a few things to try out:
> > > > > > > > 
> > > > > > > >  - Try to run: ./configure --disable-largefile; make
> > > > > > > 
> > > > > > > I extracted the source to start clean to compile...
> > > > > > > 
> > > > > > > $ ./configure --disable-largefile; make
> > > > > > [snip]
> > > > > > > checking for off_t... yes
> > > > > > [snip]
> > > > > > > make[4]: Leaving directory 
> > > > > > > `/u00/home/ant/download/elinks-0.11.1/src/document/html/parser'
> > > > > > >       [CC]   src/document/html/frames.o
> > > > > > >       [CC]   src/document/html/parser.o
> > > > > > >       [CC]   src/document/html/renderer.o
> > > > > > > In file included from ../../.././src/cache/cache.h:6,
> > > > > > >                  from renderer.c:13:
> > > > > > > ../../.././src/util/time.h:44: error: syntax error before 'n'
> > > > > > > In file included from renderer.c:13:
> > > > > > [more of the same errors reported before]
> > > > > > 
> > > > > > > >  - Try to move the line 
> > > > > > > > 
> > > > > > > > #include "elinks.h"
> > > > > > > > 
> > > > > > > >    above the line
> > > > > > > > 
> > > > > > > > #include <ctype.h>
> > > > > > > > 
> > > > > > > >    So the system headers cannot control what is included by elinks.h.
> > > > > > > > 
> > > > > > > >  - Along the same line as the above, try to add the lines:
> > > > > > > > 
> > > > > > > > #include <errno.h>
> > > > > > > > #include <stdio.h>
> > > > > > > > #include <stdlib.h>
> > > > > > > > 
> > > > > > > >    between '#include "config.h"' and '#include <ctype.h>' in
> > > > > > > >    src/document/html/renderer.c.
> > > > > > > >  
> > > > > > > >    src/document/html/frames.c includes cache/cache.h as it's first
> > > > > > > >    ELinks header file and compiles ok. Could it be that one of the
> > > > > > > >    system header files it includes does some magic?
> > > > > > > 
> > > > > > > Which file(s) are this/these in? And is this right after I extract the contents from the 
> > > > > > > source?
> > > > > > 
> > > > > > Sorry, I am sitting here buried in my own incomprehension. I want you to
> > > > > > try and change the file src/document/html/renderer.c on a clean version.
> > > > > > 
> > > > > > [ "Clean" as the file unpacked from tar.gz or tar.bz2 file. I assume
> > > > > >   that is what you mean by extracting the contents from the source. ]
> > > > > 
> > > > > Correct. I didn't want to work on containmented files. :)
> > > > 
> > > > Ok, please try the attached patch (which does what I wrote in the two
> > > > last 'long shots'). First cd into the top-level elinks directory (in
> > > > your case it looks like that is /u00/home/ant/download/elinks-0.11.1/).
> > > > Then apply it by running the following command:
> > > > 
> > > > 	patch -p1 < /path/to/attached.patch
> > 
> > $ ls
> > ABOUT-NLS  INSTALL             NEWS    Unicode         config         configure     features.conf    test
> > AUTHORS    Makefile            README  acinclude.m4    config.h       configure.in  features.log
> > BUGS       Makefile.config     SITES   aclocal.m4      config.h.in    contrib       po
> > COPYING    Makefile.config.in  THANKS  autogen.sh      config.log     debian        ppc-off_t.patch
> > ChangeLog  Makefile.lib        TODO    autom4te.cache  config.status  doc           src
> > $ patch -p1 < ppc-off_t.patch
> > patching file src/document/html/renderer.c
> > $ ./configure
> > checking for aclocal... aclocal
> > checking for autoconf... autoconf
> > checking for autoheader... autoheader
> 
> [SNIP]
> >       [CC]   src/main/event.o
> >       [CC]   src/main/interlink.o
> >       [CC]   src/main/main.o
> >       [CC]   src/main/module.o
> >       [CC]   src/main/select.o
> >       [CC]   src/main/timer.o
> > In file included from ../.././src/main/timer.h:4,
> >                  from timer.c:10:
> > ../.././src/util/time.h:44: error: syntax error before 'n'
> > make[2]: *** [timer.o] Error 1
> > make[2]: Leaving directory `/u00/home/ant/download/elinks-0.11.1/src/main'
> > make[1]: *** [all-recursive] Error 1
> > make[1]: Leaving directory `/u00/home/ant/download/elinks-0.11.1/src'
> > make: *** [all-recursive] Error 1
> 
> Try to insert that line:
> 
> #include <sys/types.h>
> 
> before 
> 
> #ifdef HAVE_SYS_TIME_H
> 
> in file src/util/time.h line 3

I re-extracted the source, repatched, and modified the time.h file to add a line. I recompiled:

$ ./configure
checking for aclocal... aclocal
checking for autoconf... autoconf
checking for autoheader... autoheader
checking for gnumake... no
checking for gmake... no
checking for make... /usr/bin/make
checking for previous build to clean... done
checking for "./features.conf"... yes
checking for "/home/ant/download/elinks-0.11.1/features.conf"... yes
checking for gcc... gcc
checking for C compiler default output file name... a.out
checking whether the C compiler works... yes
checking whether we are cross compiling... no
checking for suffix of executables... 
checking for suffix of object files... o
checking whether we are using the GNU C compiler... yes
checking whether gcc accepts -g... yes
checking for gcc option to accept ANSI C... none needed
checking for gawk... gawk
checking for gawk... /usr/bin/gawk
checking for ranlib... ranlib
checking for a BSD-compatible install... /usr/bin/install -c
checking for cg-commit-id... no
checking for sparse... no
checking for asciidoc... no
checking for xmlto... no
checking for jw... no
checking for pod2html... /usr/bin/pod2html
checking for BEOS... no
checking for RISCOS... no
checking for WIN32... no
checking for EMX... no
checking for UNIX... yes
checking for dirent.h that defines DIR... yes
checking for library containing opendir... none required
checking how to run the C preprocessor... gcc -E
checking for egrep... grep -E
checking for ANSI C header files... yes
checking for sys/wait.h that is POSIX.1 compatible... yes
checking whether time.h and sys/time.h may both be included... yes
checking for sys/types.h... yes
checking for sys/stat.h... yes
checking for stdlib.h... yes
checking for string.h... yes
checking for memory.h... yes
checking for strings.h... yes
checking for inttypes.h... yes
checking for stdint.h... yes
checking for unistd.h... yes
checking fcntl.h usability... yes
checking fcntl.h presence... yes
checking for fcntl.h... yes
checking limits.h usability... yes
checking limits.h presence... yes
checking for limits.h... yes
checking time.h usability... yes
checking time.h presence... yes
checking for time.h... yes
checking for unistd.h... (cached) yes
checking sigaction.h usability... no
checking sigaction.h presence... no
checking for sigaction.h... no
checking arpa/inet.h usability... yes
checking arpa/inet.h presence... yes
checking for arpa/inet.h... yes
checking netinet/in_systm.h usability... yes
checking netinet/in_systm.h presence... yes
checking for netinet/in_systm.h... yes
checking netinet/in_system.h usability... no
checking netinet/in_system.h presence... no
checking for netinet/in_system.h... no
checking netinet/ip.h usability... yes
checking netinet/ip.h presence... yes
checking for netinet/ip.h... yes
checking net/if.h usability... yes
checking net/if.h presence... yes
checking for net/if.h... yes
checking netdb.h usability... yes
checking netdb.h presence... yes
checking for netdb.h... yes
checking netinet/in.h usability... yes
checking netinet/in.h presence... yes
checking for netinet/in.h... yes
checking netinet/in6_var.h usability... no
checking netinet/in6_var.h presence... no
checking for netinet/in6_var.h... no
checking ifaddrs.h usability... yes
checking ifaddrs.h presence... yes
checking for ifaddrs.h... yes
checking sys/cygwin.h usability... no
checking sys/cygwin.h presence... no
checking for sys/cygwin.h... no
checking io.h usability... no
checking io.h presence... no
checking for io.h... no
checking sys/fmutex.h usability... no
checking sys/fmutex.h presence... no
checking for sys/fmutex.h... no
checking sys/ioctl.h usability... yes
checking sys/ioctl.h presence... yes
checking for sys/ioctl.h... yes
checking sys/sockio.h usability... no
checking sys/sockio.h presence... no
checking for sys/sockio.h... no
checking sys/resource.h usability... yes
checking sys/resource.h presence... yes
checking for sys/resource.h... yes
checking sys/select.h usability... yes
checking sys/select.h presence... yes
checking for sys/select.h... yes
checking sys/signal.h usability... yes
checking sys/signal.h presence... yes
checking for sys/signal.h... yes
checking sys/socket.h usability... yes
checking sys/socket.h presence... yes
checking for sys/socket.h... yes
checking sys/time.h usability... yes
checking sys/time.h presence... yes
checking for sys/time.h... yes
checking sys/utsname.h usability... yes
checking sys/utsname.h presence... yes
checking for sys/utsname.h... yes
checking for stdint.h... (cached) yes
checking for inttypes.h... (cached) yes
checking locale.h usability... yes
checking locale.h presence... yes
checking for locale.h... yes
checking pwd.h usability... yes
checking pwd.h presence... yes
checking for pwd.h... yes
checking termios.h usability... yes
checking termios.h presence... yes
checking for termios.h... yes
checking sys/un.h usability... yes
checking sys/un.h presence... yes
checking for sys/un.h... yes
checking whether struct tm is in sys/time.h or time.h... time.h
checking for an ANSI C-conforming const... yes
checking for inline... inline
checking for typeof... yes
checking for special C compiler options needed for large files... no
checking for _FILE_OFFSET_BITS value needed for large files... 64
checking for _LARGE_FILES value needed for large files... no
checking for size_t... yes
checking for off_t... yes
checking for ssize_t... yes
checking for long long... yes
checking for int32_t... yes
checking for uint32_t... yes
checking for uint16_t... yes
checking for char... yes
checking size of char... configure: error: cannot compute sizeof (char), 77
See `config.log' for more details.

I didn't get very far. Heh.


$ cat config.log    
This file contains any messages produced by compilers while
running configure, to aid debugging if configure makes a mistake.

It was created by configure, which was
generated by GNU Autoconf 2.59.  Invocation command line was

  $ ./configure 

## --------- ##
## Platform. ##
## --------- ##

hostname = dustball
uname -m = ppc
uname -r = 2.4.22-pmac-benh-dm-evms_sorta-1
uname -s = Linux
uname -v = #4 Mon Oct 20 21:58:29 PDT 2003

/usr/bin/uname -p = unknown
/bin/uname -X     = unknown

/bin/arch              = ppc
/usr/bin/arch -k       = unknown
/usr/convex/getsysinfo = unknown
hostinfo               = unknown
/bin/machine           = unknown
/usr/bin/oslevel       = unknown
/bin/universe          = unknown

PATH: /home/ant/bin
PATH: /usr/local/bin
PATH: /usr/bin
PATH: /bin
PATH: /usr/bin/X11
PATH: /usr/games


## ----------- ##
## Core tests. ##
## ----------- ##

configure:1404: checking for aclocal
configure:1420: found /usr/bin/aclocal
configure:1431: result: aclocal
configure:1440: checking for autoconf
configure:1456: found /usr/bin/autoconf
configure:1467: result: autoconf
configure:1476: checking for autoheader
configure:1492: found /usr/bin/autoheader
configure:1503: result: autoheader
configure:1519: checking for gnumake
configure:1552: result: no
configure:1519: checking for gmake
configure:1552: result: no
configure:1519: checking for make
configure:1537: found /usr/bin/make
configure:1549: result: /usr/bin/make
configure:1566: checking for previous build to clean
configure:1569: result: done
configure:1576: checking for "./features.conf"
configure:1591: result: yes
configure:1598: checking for "/home/ant/download/elinks-0.11.1/features.conf"
configure:1613: result: yes
configure:1668: checking for gcc
configure:1684: found /usr/bin/gcc
configure:1694: result: gcc
configure:1938: checking for C compiler version
configure:1941: gcc --version </dev/null >&5
gcc (GCC) 4.0.3 20051201 (prerelease) (Debian 4.0.2-5)
Copyright (C) 2005 Free Software Foundation, Inc.
This is free software; see the source for copying conditions.  There is NO
warranty; not even for MERCHANTABILITY or FITNESS FOR A PARTICULAR PURPOSE.

configure:1944: $? = 0
configure:1946: gcc -v </dev/null >&5
Using built-in specs.
Target: powerpc-linux-gnu
Configured with: ../src/configure -v --enable-languages=c,c++,java,f95,objc,ada,treelang 
--prefix=/usr --enable-shared --with-system-zlib --libexecdir=/usr/lib --without-included-gettext 
--enable-threads=posix --enable-nls --program-suffix=-4.0 --enable-__cxa_atexit 
--enable-clocale=gnu --enable-libstdcxx-debug --enable-java-awt=gtk-default --enable-gtk-cairo 
--with-java-home=/usr/lib/jvm/java-1.4.2-gcj-4.0-1.4.2.0/jre --enable-mpfr --disable-softfloat 
--enable-targets=powerpc-linux,powerpc64-linux --with-cpu=default32 --disable-werror 
--enable-checking=release powerpc-linux-gnu
Thread model: posix
gcc version 4.0.3 20051201 (prerelease) (Debian 4.0.2-5)
configure:1949: $? = 0
configure:1951: gcc -V </dev/null >&5
gcc: '-V' option must have argument
configure:1954: $? = 1
configure:1977: checking for C compiler default output file name
configure:1980: gcc    conftest.c  >&5
configure:1983: $? = 0
configure:2029: result: a.out
configure:2034: checking whether the C compiler works
configure:2040: ./a.out
configure:2043: $? = 0
configure:2060: result: yes
configure:2067: checking whether we are cross compiling
configure:2069: result: no
configure:2072: checking for suffix of executables
configure:2074: gcc -o conftest    conftest.c  >&5
configure:2077: $? = 0
configure:2102: result: 
configure:2108: checking for suffix of object files
configure:2129: gcc -c   conftest.c >&5
configure:2132: $? = 0
configure:2154: result: o
configure:2158: checking whether we are using the GNU C compiler
configure:2182: gcc -c   conftest.c >&5
configure:2188: $? = 0
configure:2192: test -z 
                         || test ! -s conftest.err
configure:2195: $? = 0
configure:2198: test -s conftest.o
configure:2201: $? = 0
configure:2214: result: yes
configure:2220: checking whether gcc accepts -g
configure:2241: gcc -c -g  conftest.c >&5
configure:2247: $? = 0
configure:2251: test -z 
                         || test ! -s conftest.err
configure:2254: $? = 0
configure:2257: test -s conftest.o
configure:2260: $? = 0
configure:2271: result: yes
configure:2288: checking for gcc option to accept ANSI C
configure:2358: gcc  -c -g -O2  conftest.c >&5
configure:2364: $? = 0
configure:2368: test -z 
                         || test ! -s conftest.err
configure:2371: $? = 0
configure:2374: test -s conftest.o
configure:2377: $? = 0
configure:2395: result: none needed
configure:2413: gcc -c -g -O2  conftest.c >&5
conftest.c:2: error: syntax error before 'me'
configure:2419: $? = 1
configure: failed program was:
| #ifndef __cplusplus
|   choke me
| #endif
configure:2556: checking for gawk
configure:2572: found /usr/bin/gawk
configure:2582: result: gawk
configure:2596: checking for gawk
configure:2614: found /usr/bin/gawk
configure:2626: result: /usr/bin/gawk
configure:2677: checking for ranlib
configure:2693: found /usr/bin/ranlib
configure:2704: result: ranlib
configure:2729: checking for a BSD-compatible install
configure:2784: result: /usr/bin/install -c
configure:2800: checking for cg-commit-id
configure:2833: result: no
configure:2844: checking for sparse
configure:2877: result: no
configure:2895: checking for asciidoc
configure:2928: result: no
configure:2972: checking for xmlto
configure:3005: result: no
configure:3043: checking for jw
configure:3076: result: no
configure:3106: checking for pod2html
configure:3124: found /usr/bin/pod2html
configure:3136: result: /usr/bin/pod2html
configure:3350: checking for BEOS
configure:3372: gcc -c -g -O2 -Wall  conftest.c >&5
conftest.c: In function 'main':
conftest.c:18: error: 'kill' undeclared (first use in this function)
conftest.c:18: error: (Each undeclared identifier is reported only once
conftest.c:18: error: for each function it appears in.)
conftest.c:18: error: syntax error before 'me'
configure:3378: $? = 1
configure: failed program was:
| /* confdefs.h.  */
| 
| #define PACKAGE_NAME ""
| #define PACKAGE_TARNAME ""
| #define PACKAGE_VERSION ""
| #define PACKAGE_STRING ""
| #define PACKAGE_BUGREPORT ""
| #define PACKAGE "elinks"
| #define VERSION "0.11.1"
| #define CONFIG_POD2HTML 1
| #define CONFIG_DOC 1
| /* end confdefs.h.  */
| 
| int
| main ()
| {
| #ifndef __BEOS__
| kill me!
| #endif
|   ;
|   return 0;
| }
configure:3414: result: no
configure:3420: checking for RISCOS
configure:3442: gcc -c -g -O2 -Wall  conftest.c >&5
conftest.c: In function 'main':
conftest.c:18: error: 'kill' undeclared (first use in this function)
conftest.c:18: error: (Each undeclared identifier is reported only once
conftest.c:18: error: for each function it appears in.)
conftest.c:18: error: syntax error before 'me'
configure:3448: $? = 1
configure: failed program was:
| /* confdefs.h.  */
| 
| #define PACKAGE_NAME ""
| #define PACKAGE_TARNAME ""
| #define PACKAGE_VERSION ""
| #define PACKAGE_STRING ""
| #define PACKAGE_BUGREPORT configure:4494: gcc -c -g -O2 -Wall  conftest.c >&5
configure:4500: $? = 0
configure:4504: test -z 
                         || test ! -s conftest.err
configure:4507: $? = 0
configure:4510: test -s conftest.o
configure:4513: $? = 0
configure:4524: result: yes
configure:4549: checking for sys/types.h
configure:4565: gcc -c -g -O2 -Wall  conftest.c >&5
configure:4571: $? = 0
configure:4575: test -z 
                         || test ! -s conftest.err
configure:4578: $? = 0
configure:4581: test -s conftest.o
configure:4584: $? = 0
configure:4595: result: yes
configure:4549: checking for sys/stat.h
configure:4565: gcc -c -g -O2 -Wall  conftest.c >&5
configure:4571: $? = 0
configure:4575: test -z 
                         || test ! -s conftest.err
configure:4578: $? = 0
configure:4581: test -s conftest.o
configure:4584: $? = 0
configure:4595: result: yes
configure:4549: checking for stdlib.h
configure:4565: gcc -c -g -O2 -Wall  conftest.c >&5
configure:4571: $? = 0
configure:4575: test -z 
                         || test ! -s conftest.err
configure:4578: $? = 0
configure:4581: test -s conftest.o
configure:4584: $? = 0
configure:4595: result: yes
configure:4549: checking for string.h
configure:4565: gcc -c -g -O2 -Wall  conftest.c >&5
configure:4571: $? = 0
configure:4575: test -z 
                         || test ! -s conftest.err
configure:4578: $? = 0
configure:4581: test -s conftest.o
configure:4584: $? = 0
configure:4595: result: yes
configure:4549: checking for memory.h
configure:4565: gcc -c -g -O2 -Wall  conftest.c >&5
configure:4571: $? = 0
configure:4575: test -z 
                         || test ! -s conftest.err
configure:4578: $? = 0
configure:4581: test -s conftest.o
configure:4584: $? = 0
configure:4595: result: yes
configure:4549: checking for strings.h
configure:4565: gcc -c -g -O2 -Wall  conftest.c >&5
configure:4571: $? = 0
configure:4575: test -z 
                         || test ! -s conftest.err
configure:4578: $? = 0
configure:4581: test -s conftest.o
configure:4584: $? = 0
configure:4595: resultac_cv_header_sys_types_h=yes
ac_cv_header_sys_un_h=yes
ac_cv_header_sys_utsname_h=yes
ac_cv_header_sys_wait_h=yes
ac_cv_header_termios_h=yes
ac_cv_header_time=yes
ac_cv_header_time_h=yes
ac_cv_header_unistd_h=yes
ac_cv_objext=o
ac_cv_path_AWK=/usr/bin/gawk
ac_cv_path_MAKE=/usr/bin/make
ac_cv_path_POD2HTML=/usr/bin/pod2html
ac_cv_path_install='/usr/bin/install -c'
ac_cv_prog_ACLOCAL=aclocal
ac_cv_prog_AUTOCONF=autoconf
ac_cv_prog_AUTOHEADER=autoheader
ac_cv_prog_AWK=gawk
ac_cv_prog_CPP='gcc -E'
ac_cv_prog_ac_ct_CC=gcc
ac_cv_prog_ac_ct_RANLIB=ranlib
ac_cv_prog_cc_g=yes
ac_cv_prog_cc_stdc=
ac_cv_prog_egrep='grep -E'
ac_cv_search_opendir='none required'
ac_cv_struct_tm=time.h
ac_cv_sys_file_offset_bits=64
ac_cv_sys_large_files=no
ac_cv_sys_largefile_CC=no
ac_cv_type_char=yes
ac_cv_type_off_t=yes
ac_cv_type_size_t=yes

## ----------------- ##
## Output variables. ##
## ----------------- ##

ACLOCAL='aclocal'
ALLOCA=''
ALL_CFLAGS=''
ASCIIDOC=''
ASCIIDOC_FLAGS=''
AUTOCONF='autoconf'
AUTOHEADER='autoheader'
AWK='/usr/bin/gawk'
CATALOGS=''
CC='gcc'
CFLAGS='-g -O2 -Wall'
CG_COMMIT_ID=''
CONFDIR=''
CONFIG_256_COLORS='no'
CONFIG_88_COLORS='no'
CONFIG_ASCIIDOC='no'
CONFIG_BACKTRACE='yes'
CONFIG_BEOS='no'
CONFIG_BITTORRENT='no'
CONFIG_BOOKMARKS='yes'
CONFIG_BZIP2=''
CONFIG_CGI='no'
CONFIG_COOKIES='yes'
CONFIG_CSS='yes'
CONFIG_DATA='yes'
CONFIG_DEBUG='no'
CONFIG_DOC='yes'
CONFIG_DOM=''
CONFIG_ECMASCRIPT=''
CONFIG_EXMODE='no'
CONFIG_FASTMEM='no'
CONFIG_FINGER='no'
CONFIG_FORMHIST='yes'
CONFIG_FSP='no'
CONFIG_FTP='yes'
CONFIG_GLOBHIST='yes'
CONFIG_GNUTLS=''
CONFIG_GNUTLS_OPENSSL_COMPAT=''
CONFIG_GOPHER='no'
CONFIG_GPM=''
CONFIG_GUILE=''
CONFIG_GZIP=''
CONFIG_HTML_HIGHLIGHT='no'
CONFIG_IDN=''
CONFIG_INTERLINK='yes'
CONFIG_IPV6='yes'
CONFIG_JW='no'
CONFIG_LEDS='yes'
CONFIG_LUA=''
CONFIG_MAILCAP='yes'
CONFIG_MANUAL=''
CONFIG_MARKS='yes'
CONFIG_MD5=''
CONFIG_MIMETYPES='yes'
CONFIG_MOUSE='yes'
CONFIG_NLS=''
CONFIG_NLS_FALSE=''
CONFIG_NLS_TRUE=''
CONFIG_NNTP='no'
CONFIG_NO_ROOT_EXEC='no'
CONFIG_OPENSSL=''
CONFIG_OS2='no'
CONFIG_OWN_LIBC='no'
CONFIG_PERL=''
CONFIG_POD2HTML='yes'
CONFIG_PYTHON=''
CONFIG_RISCOS='no'
CONFIG_RUBY=''
CONFIG_SCANNER=''
CONFIG_SCRIPTING=''
CONFIG_SHA1=''
CONFIG_SMALL='no'
CONFIG_SMB='yes'
CONFIG_SM_SCRIPTING='yes'
CONFIG_SPIDERMONKEY=''
CONFIG_SSL=''
CONFIG_SYSMOUSE=''
CONFIG_UNIX='yes'
CONFIG_URI_REWRITE='yes'
CONFIG_WIN32='no'
CONFIG_XBEL_BOOKMARKS='yes'
CONFIG_XMLTO='no'
CPP='gcc -E'
CPPFLAGS=''
DEFS=''
ECHO_C=''
ECHO_N='-n'
ECHO_T=''
EGREP='grep -E'
EXEEXT=''
GLIBC21=''
GMOFILES=''
GMSGFMT=''
GNUTLS_CFLAGS=''
GUILE_CFLAGS=''
GUILE_CONFIG=''
HAVE_SMBCLIENT=''
INSTALL_DATA='${INSTALL} -m 644'
INSTALL_PROGRAM='${INSTALL}'
INSTALL_SCRIPT='${INSTALL}'
INTLBISON=''
INTL_LIBTOOL_SUFFIX_PREFIX=''
JW=''
LDFLAGS=''
LIBDIR=''
LIBGNUTLS_CONFIG=''
LIBOBJS=''
LIBS=''
LOCALEDIR=''
LTLIBOBJS=''
LUA_CFLAGS=''
LUA_LIBS=''
MAKE='/usr/bin/make'
MAKE_COLOR=''
MKINSTALLDIRS=''
MSGFMT=''
OBJEXT='o'
OPENSSL_CFLAGS=''
PACKAGE='elinks'
PACKAGE_BUGREPORT=''
PACKAGE_NAME=''
PACKAGE_STRING=''
PACKAGE_TARNAME=''
PACKAGE_VERSION=''
PATH_SEPARATOR=':'
PERL_CFLAGS=''
PERL_LIBS=''
POD2HTML='/usr/bin/pod2html'
PYTHON_CFLAGS=''
PYTHON_LIBS=''
RANLIB='ranlib'
RUBY_CFLAGS=''
RUBY_LIBS=''
SET_MAKE=''
SHELL='/bin/sh'
SPARSE=''
SPIDERMONKEY_CFLAGS=''
SPIDERMONKEY_LIBS=''
VERSION='0.11.1'
XGETTEXT=''
XMLTO=''
X_CFLAGS=''
ac_ct_CC='gcc'
ac_ct_RANLIB='ranlib'
bindir='${exec_prefix}/bin'
build=''
build_alias=''
build_cpu=''
build_os=''
build_vendor=''
datadir='${prefix}/share'
exec_prefix='NONE'
host=''
host_alias=''
host_cpu=''
host_os=''
host_vendor=''
includedir='${prefix}/include'
infodir='${prefix}/info'
libdir='${exec_prefix}/lib'
libexecdir='${exec_prefix}/libexec'
localstatedir='${prefix}/var'
mandir='${prefix}/man'
oldincludedir='/usr/include'
prefix='NONE'
program_transform_name='s,x,x,'
sbindir='${exec_prefix}/sbin'
sharedstatedir='${prefix}/com'
sysconfdir='${prefix}/etc'
target_alias=''

## ----------- ##
## confdefs.h. ##
## ----------- ##

#define CONFIG_DOC 1
#define CONFIG_INTERLINK 1
#define CONFIG_POD2HTML 1
#define CONFIG_UNIX 1
#define HAVE_ARPA_INET_H 1
#define HAVE_DIRENT_H 1
#define HAVE_FCNTL_H 1
#define HAVE_IFADDRS_H 1
#define HAVE_INT32_T 1
#define HAVE_INTTYPES_H 1
#define HAVE_INTTYPES_H 1
#define HAVE_LIMITS_H 1
#define HAVE_LOCALE_H 1
#define HAVE_LONG_LONG 1
#define HAVE_MEMORY_H 1
#define HAVE_NETDB_H 1
#define HAVE_NETINET_IN_H 1
#define HAVE_NETINET_IN_SYSTM_H 1
#define HAVE_NETINET_IP_H 1
#define HAVE_NET_IF_H 1
#define HAVE_PWD_H 1
#define HAVE_STDINT_H 1
#define HAVE_STDINT_H 1
#define HAVE_STDLIB_H 1
#define HAVE_STRINGS_H 1
#define HAVE_STRING_H 1
#define HAVE_SYS_IOCTL_H 1
#define HAVE_SYS_RESOURCE_H 1
#define HAVE_SYS_SELECT_H 1
#define HAVE_SYS_SIGNAL_H 1
#define HAVE_SYS_SOCKET_H 1
#define HAVE_SYS_STAT_H 1
#define HAVE_SYS_TIME_H 1
#define HAVE_SYS_TYPES_H 1
#define HAVE_SYS_UN_H 1
#define HAVE_SYS_UTSNAME_H 1
#define HAVE_SYS_WAIT_H 1
#define HAVE_TERMIOS_H 1
#define HAVE_TIME_H 1
#define HAVE_TYPEOF 1
#define HAVE_UINT16_T 1
#define HAVE_UINT32_T 1
#define HAVE_UNISTD_H 1
#define HAVE_UNISTD_H 1
#define PACKAGE "elinks"
#define PACKAGE_BUGREPORT ""
#define PACKAGE_NAME ""
#define PACKAGE_STRING ""
#define PACKAGE_TARNAME ""
#define PACKAGE_VERSION ""
#define STDC_HEADERS 1
#define TIME_WITH_SYS_TIME 1
#define VERSION "0.11.1"
#define _FILE_OFFSET_BITS 64

configure: exit 1
-- 
"It is not enough to be industrious; so are the ants. What are you industrious about?" --Henry David Thoreau
  /\___/\
 / /\ /\ \     Phillip (Ant) @ http://antfarm.ma.cx (Personal Web Site)
| |o   o| |         Ant's Quality Foraged Links (AQFL): http://aqfl.net
   \ _ /                 E-mail: philpi at earthlink.net or ant at zimage.com
    ( )



More information about the elinks-users mailing list