Fileutils-4.0 Static compilation error

Jason Gurtz flare at
Wed Aug 16 19:48:32 PDT 2000

I'm experimenting.  The base system is a Caldera technology preview
developer release.  I'm using LFS-2.3.7

base system includes:

gcc 2.95.2
glibc 2.1.91

I get the following error when doing the initial static compile of

gcc -DLOCALEDIR=\"/usr/share/locale\" -DSHAREDIR=\"/usr/share\" -DHAVE_CONFI
G_H -I.. -I. -I../lib -I../intl    -O3 -mcpu=i586 -march=i586 -c dircolors.c
dircolors.c:40: macro `strndup' used without args
make[2]: *** [dircolors.o] Error 1
make[2]: Leaving directory `/lfs/usr/src/f/fileutils-4.0/src'
make[1]: *** [all-recursive] Error 1
make[1]: Leaving directory `/lfs/usr/src/f/fileutils-4.0'
make: *** [all-recursive-am] Error 2
[root at miscanthus fileutils-4.0]#

Anyone have any hints?


Mail archive:
IRC access: server: port: 6667 channel: #LFS
Unsubscribe: email lfs-discuss-request at and put
"unsubscribe" (without the quotation marks) in the body of the message
(no subject is required)

More information about the lfs-dev mailing list