Fileutils

WarmFuzzy hugo1301 at home.com
Sat Dec 30 22:37:22 PST 2000


Hi,

I'm trying to compile Filutils. It ends with the below:

In file included from safe-read.c:26:
/usr/include/unistd.h:199: No include path in which to find stddef.h
make[2] *** [safe-read.o] Error 1
make[2] leaving directory '/usr/src/fileutils-4.0/lib'
make[1] *** [all-recursive] Error 1
make[1] leaving directory '/usr/src/fileutils-4.0'
make: *** [all-recursive-am] Error 2

help. I'm comiling "--with-curses" now.

hugo

-- 
Unsubscribe: send email to lfs-discuss-request at linuxfromscratch.org
and put unsubscribe in the subject header of the message




More information about the lfs-dev mailing list