sh-utils

Super supers at oceanfree.net
Tue Mar 6 06:39:12 PST 2001


anyone have ever compile sh-utils with this error ?

../lib/libsu.a(mktime.o):/root/LFS/usr/src/sh-utils-2.0/lib/mktime.c:227:
first defined here
collect2: ld returned 1 exit status
make[2]: *** [date] Error 1
make[2]: Leaving directory `/root/LFS/usr/src/sh-utils-2.0/src'
make[1]: *** [all-recursive] Error 1
make[1]: Leaving directory `/root/LFS/usr/src/sh-utils-2.0'
make: *** [all-recursive-am] Error 2

it happened when compiling sh-utils -static
any clue how to fix it ?
**i use slackware 7.1**
thanks

regards
soragan



-- 
Unsubscribe: send email to lfs-discuss-request at linuxfromscratch.org
and put unsubscribe in the subject header of the message




More information about the lfs-dev mailing list