glibc-2.3 is out

Lee Hancock Lee at hancock1980.freeserve.co.uk
Sat Oct 5 11:09:51 PDT 2002


I had the same errors. So I grabbed the latest cvs version of gcc ( cvs 
rdiff -r gcc_3_2_release -r gcc-3_2-branch gcc > gcc-3.2.1.patch )Then 
applied the patch. Should work now.


Lasse Kliemann wrote:
> * Greg Schafer writes:
> 
>>Anyone doing test LFS builds with gcc-3.2 will probably want the gcc patch
>>mentioned at the bottom of this post:-
>>
>>http://sources.redhat.com/ml/libc-alpha/2002-10/msg00031.html
>>
>>as stock gcc-3.2 will not build against glibc-2.3. I haven't tried that patch
>>(yet!).
> 
> 
> I have, and the result is attached to this mail. I had also applied your "var"
> and "copy" fix.
> 
> I can find nothing on these errors in the archives of neither glibc nor gcc.
> Any ideas?
> 
> Lasse
> 
> 
> ------------------------------------------------------------------------
> 
> /var/root/gcc.19069/compile/gcc-build/gcc/xgcc -shared-libgcc -B/var/root/gcc.19069/compile/gcc-build/gcc/ -nostdinc++ -L/var/root/gcc.19069/compile/gcc-build/i586-pc-linux-gnu/libstdc++-v3/src -L/var/root/gcc.19069/compile/gcc-build/i586-pc-linux-gnu/libstdc++-v3/src/.libs -B/package/host/localhost/gcc-3.2/i586-pc-linux-gnu/bin/ -B/package/host/localhost/gcc-3.2/i586-pc-linux-gnu/lib/ -isystem /package/host/localhost/gcc-3.2/i586-pc-linux-gnu/include -nostdinc++ -I/var/root/gcc.19069/compile/gcc-build/i586-pc-linux-gnu/libstdc++-v3/include/i586-pc-linux-gnu -I/var/root/gcc.19069/compile/gcc-build/i586-pc-linux-gnu/libstdc++-v3/include -I/var/root/gcc.19069/compile/gcc-3.2/libstdc++-v3/libsupc++ -I/var/root/gcc.19069/compile/gcc-3.2/libstdc++-v3/libmath -g -O2 -D_GNU_SOURCE -fno-implicit-templates -Wall -Wno-format -W -Wwrite-strings -Winline -fdiagnostics-show-location=once -ffunction-sections -fdata-sections -g -c /var/root/gcc.19069/compile/gcc-3.2/libstdc++-v3/src/local
e.cc  -fPIC -DPIC -o .libs/locale.o
> In file included from /var/root/gcc.19069/compile/gcc-3.2/libstdc++-v3/src/locale.cc:406:
> /var/root/gcc.19069/compile/gcc-build/i586-pc-linux-gnu/libstdc++-v3/include/i586-pc-linux-gnu/bits/ctype_noninline.h: In
>    static member function `static const short unsigned int* 
>    std::ctype<char>::classic_table()':
> /var/root/gcc.19069/compile/gcc-build/i586-pc-linux-gnu/libstdc++-v3/include/i586-pc-linux-gnu/bits/ctype_noninline.h:45: `
>    __ctype_b' undeclared (first use this function)
> /var/root/gcc.19069/compile/gcc-build/i586-pc-linux-gnu/libstdc++-v3/include/i586-pc-linux-gnu/bits/ctype_noninline.h:45: (Each
>    undeclared identifier is reported only once for each function it appears 
>    in.)
> In file included from /var/root/gcc.19069/compile/gcc-3.2/libstdc++-v3/src/locale.cc:406:
> /var/root/gcc.19069/compile/gcc-build/i586-pc-linux-gnu/libstdc++-v3/include/i586-pc-linux-gnu/bits/ctype_noninline.h: In
>    constructor `std::ctype<char>::ctype(const short unsigned int*, bool, 
>    unsigned int)':
> /var/root/gcc.19069/compile/gcc-build/i586-pc-linux-gnu/libstdc++-v3/include/i586-pc-linux-gnu/bits/ctype_noninline.h:68: `
>    __ctype_toupper' undeclared (first use this function)
> /var/root/gcc.19069/compile/gcc-build/i586-pc-linux-gnu/libstdc++-v3/include/i586-pc-linux-gnu/bits/ctype_noninline.h:68: `
>    __ctype_tolower' undeclared (first use this function)
> make[4]: *** [locale.lo] Error 1
> make[4]: Leaving directory `/var/root/gcc.19069/compile/gcc-build/i586-pc-linux-gnu/libstdc++-v3/src'
> make[3]: *** [all-recursive] Error 1
> make[3]: Leaving directory `/var/root/gcc.19069/compile/gcc-build/i586-pc-linux-gnu/libstdc++-v3'
> make[2]: *** [all-recursive-am] Error 2
> make[2]: Leaving directory `/var/root/gcc.19069/compile/gcc-build/i586-pc-linux-gnu/libstdc++-v3'
> make[1]: *** [all-target-libstdc++-v3] Error 2
> make[1]: Leaving directory `/var/root/gcc.19069/compile/gcc-build'
> make: *** [bootstrap] Error 2

-- 
Unsubscribe: send email to listar at linuxfromscratch.org
and put 'unsubscribe lfs-dev' in the subject header of the message



More information about the lfs-dev mailing list