binutils make check fails in cvs chap6

Jon Ringle jon.ringle at comdial.com
Fri Jun 6 08:38:13 PDT 2003


I banged my head against this one for a couple days. I finally found a similar 
problem encountered in the archives, because there were no ptys.

I had done a ./MAKEDEV -v generic-nopty earlier, and it resulted in the 
problem I was having while running make check in the chap 6 binutils (cvs 
lfs).

Perhaps a faq entry could be put in describing this issue. None of the error 
text lead me to believe that lack of ptys was my problem.

Also, perhaps some warning text in MAKEDEV step of chap 6 indicating that ptys 
are required in order for future make checks to work properly.

Jon

		=== binutils tests ===

Schedule of variations:
    unix

Running target unix
Using /stage1/share/dejagnu/baseboards/unix.exp as board description file for 
target.
Using /stage1/share/dejagnu/config/unix.exp as generic interface file for 
target.
Using /stage1/src/binutils-2.13.2/binutils/testsuite/config/default.exp as 
tool-and-target-specific interface file.
Running /stage1/src/binutils-2.13.2/binutils/testsuite/binutils-all/ar.exp ...
FAIL: ar long file names
ERROR: /stage1/src/binutils-2.13.2/binutils/testsuite/binutils-all/bintest.s: 
assembly failed
Running 
/stage1/src/binutils-2.13.2/binutils/testsuite/binutils-all/hppa/objdump.exp 
...
Running /stage1/src/binutils-2.13.2/binutils/testsuite/binutils-all/nm.exp ...
Version /stage1/src/binutils-build/binutils/nm-new failed
ERROR: /stage1/src/binutils-2.13.2/binutils/testsuite/binutils-all/bintest.s: 
assembly failed
Running 
/stage1/src/binutils-2.13.2/binutils/testsuite/binutils-all/objcopy.exp ...
Version /stage1/src/binutils-build/binutils/objcopy failed
ERROR: /stage1/src/binutils-2.13.2/binutils/testsuite/binutils-all/bintest.s: 
assembly failed
ERROR: unresolved 1
Running 
/stage1/src/binutils-2.13.2/binutils/testsuite/binutils-all/objdump.exp ...
Version /stage1/src/binutils-build/binutils/objdump failed
FAIL: objdump -i
ERROR: /stage1/src/binutils-2.13.2/binutils/testsuite/binutils-all/bintest.s: 
assembly failed
Running 
/stage1/src/binutils-2.13.2/binutils/testsuite/binutils-all/readelf.exp ...
Version /stage1/src/binutils-build/binutils/readelf failed
ERROR: /stage1/src/binutils-2.13.2/binutils/testsuite/binutils-all/bintest.s: 
assembly failed
ERROR: unresolved 1
Running /stage1/src/binutils-2.13.2/binutils/testsuite/binutils-all/size.exp 
...
Version /stage1/src/binutils-build/binutils/size failed
ERROR: /stage1/src/binutils-2.13.2/binutils/testsuite/binutils-all/bintest.s: 
assembly failed
Running 
/stage1/src/binutils-2.13.2/binutils/testsuite/binutils-all/windres/windres.exp 
...

		=== binutils Summary ===

# of unexpected failures	2
# of unresolved testcases	3
make[4]: *** [check-DEJAGNU] Error 1
make[4]: Leaving directory `/stage1/src/binutils-build/binutils'
make[3]: *** [check-am] Error 2
make[3]: Leaving directory `/stage1/src/binutils-build/binutils'
make[2]: *** [check-recursive] Error 1
make[2]: Leaving directory `/stage1/src/binutils-build/binutils'
make[1]: *** [check-binutils] Error 2
make[1]: Leaving directory `/stage1/src/binutils-build'
make: *** [check] Error 2

-- 
Unsubscribe: send email to listar at linuxfromscratch.org
and put 'unsubscribe lfs-dev' in the subject header of the message



More information about the lfs-dev mailing list