pure lfs glibc-2.3.2 "make check" error

sleeve sleeve at 21cn.com
Sat Mar 22 12:39:11 PST 2003


Hi

I`m first build Pure LFS
 on ch5 pass1 build glibc-2.3.2 make check error

binutils-2.13.2
gcc-3.2.2
glibc-2.3.2

gcc -B/stage1/bin/ -nostdlib -nostartfiles -o
/home/lfs/glibc-build/libio/tst-atime
-Wl,-dynamic-linker=/stage1/lib/ld-linux.so.2 -s  -Wl,-z,combreloc
/home/lfs/glibc-build/csu/crt1.o /home/lfs/glibc-build/csu/crti.o `gcc
-B/stage1/bin/ --print-file-name=crtbegin.o`
/home/lfs/glibc-build/libio/tst-atime.o
-Wl,-rpath-link=/home/lfs/glibc-build:/home/lfs/glibc-build/math:/home/lfs/glibc-build/elf:/home/lfs/glibc-build/dlfcn:/home/lfs/glibc-build/nss:/home/lfs/glibc-build/nis:/home/lfs/glibc-build/rt:/home/lfs/glibc-build/resolv:/home/lfs/glibc-build/crypt:/home/lfs/glibc-build/linuxthreads
/home/lfs/glibc-build/libc.so.6 /home/lfs/glibc-build/libc_nonshared.a
-lgcc `gcc -B/stage1/bin/ --print-file-name=crtend.o`
/home/lfs/glibc-build/csu/crtn.o
GCONV_PATH=/home/lfs/glibc-build/iconvdata LC_ALL=C
/home/lfs/glibc-build/elf/ld-linux.so.2 --library-path
/home/lfs/glibc-build:/home/lfs/glibc-build/math:/home/lfs/glibc-build/elf:/home/lfs/glibc-build/dlfcn:/home/lfs/glibc-build/nss:/home/lfs/glibc-build/nis:/home/lfs/glibc-build/rt:/home/lfs/glibc-build/resolv:/home/lfs/glibc-build/crypt:/home/lfs/glibc-build/linuxthreads
/home/lfs/glibc-build/libio/tst-atime  >
/home/lfs/glibc-build/libio/tst-atime.out
make[2]: *** [/home/lfs/glibc-build/libio/tst-atime.out] Error 1
make[2]: Leaving directory `/home/lfs/glibc-2.3.2/libio'
make[1]: *** [libio/tests] Error 2
make[1]: Leaving directory `/home/lfs/glibc-2.3.2'
make: *** [check] Error 2
[lfs at sleeve ~/glibc-build]$

i scan the mailist.. but cant find the same case.
Thanks.

-- 
Unsubscribe: send email to listar at linuxfromscratch.org
and put 'unsubscribe lfs-dev' in the subject header of the message



More information about the lfs-dev mailing list