pure lfs .. make -k check failure

Juan York jyorkhsd at earthlink.net
Sun Mar 30 19:27:34 PST 2003


hey guys building pure lfs and make -k check is bailing on me on gcc 
pass 2

-J

                 === libstdc++-v3 Summary ===

# of expected passes            432
# of unexpected failures        1
# of unexpected successes       26
make[4]: *** [check-DEJAGNU] Error 1
make[4]: Leaving directory 
`/home/lfs/newlfs/gcc-build/i686-pc-linux-gnu/libstdc++-v3/testsuite'
make[3]: *** [check-am] Error 2
make[3]: Target `check' not remade because of errors.
make[3]: Leaving directory 
`/home/lfs/newlfs/gcc-build/i686-pc-linux-gnu/libstdc++-v3/testsuite'
make[3]: Entering directory 
`/home/lfs/newlfs/gcc-build/i686-pc-linux-gnu/libstdc++-v3'
make[3]: Nothing to be done for `check-am'.
make[3]: Leaving directory 
`/home/lfs/newlfs/gcc-build/i686-pc-linux-gnu/libstdc++-v3'
make[2]: *** [check-recursive] Error 1
make[2]: Target `check' not remade because of errors.
make[2]: Leaving directory 
`/home/lfs/newlfs/gcc-build/i686-pc-linux-gnu/libstdc++-v3'
make[1]: *** [check-target-libstdc++-v3] Error 2
make[2]: Entering directory 
`/home/lfs/newlfs/gcc-build/i686-pc-linux-gnu/libiberty'
make[3]: Entering directory 
`/home/lfs/newlfs/gcc-build/i686-pc-linux-gnu/libiberty/testsuite'
make[3]: Nothing to be done for `check'.
make[3]: Leaving directory 
`/home/lfs/newlfs/gcc-build/i686-pc-linux-gnu/libiberty/testsuite'
make[2]: Leaving directory 
`/home/lfs/newlfs/gcc-build/i686-pc-linux-gnu/libiberty'
make[2]: Entering directory `/home/lfs/newlfs/gcc-build/gcc'
Making a new config file...
echo "set tmpdir /home/lfs/newlfs/gcc-build/gcc/testsuite" >> ./tmp0
test -d testsuite || mkdir testsuite
rm -f testsuite/site.exp
sed '/set tmpdir/ s|testsuite|testsuite|' < site.exp > 
testsuite/site.exp
(rootme=`pwd`; export rootme; \
srcdir=`cd ../../gcc-3.2.2/gcc; pwd` ; export srcdir ; \
cd testsuite; \
EXPECT=expect ; export EXPECT ; \
if [ -f ${rootme}/../expect/expect ] ; then  \
    TCL_LIBRARY=`cd .. ; cd ../../gcc-3.2.2/gcc/../tcl/library ; pwd` ; 
\
    export TCL_LIBRARY ; fi ; \
runtest --tool gcc )
WARNING: Couldn't find the global config file.
WARNING: Couldn't find tool init file
Test Run By jyork on Mon Mar 31 03:19:28 2003
Native configuration is i686-pc-linux-gnu

                 === gcc tests ===

Schedule of variations:
     unix

Running target unix
Using /stage1/share/dejagnu/baseboards/unix.exp as board description 
file for target.
Using /stage1/share/dejagnu/config/unix.exp as generic interface file 
for target.
WARNING: Couldn't find tool config file for unix, using default.

                 === gcc Summary ===

if (autogen --ver=v) > /dev/null 2>&1 ; \
then cd fixinc && make check ; \
else true ; fi
(rootme=`pwd`; export rootme; \
srcdir=`cd ../../gcc-3.2.2/gcc; pwd` ; export srcdir ; \
cd testsuite; \
EXPECT=expect ; export EXPECT ; \
if [ -f ${rootme}/../expect/expect ] ; then  \
    TCL_LIBRARY=`cd .. ; cd ../../gcc-3.2.2/gcc/../tcl/library ; pwd` ; 
\
     export TCL_LIBRARY ; fi ; \
runtest --tool g++ )
WARNING: Couldn't find the global config file.
WARNING: Couldn't find tool init file
Test Run By jyork on Mon Mar 31 03:19:28 2003
Native configuration is i686-pc-linux-gnu

                 === g++ tests ===

Schedule of variations:
     unix

Running target unix
Using /stage1/share/dejagnu/baseboards/unix.exp as board description 
file for target.
Using /stage1/share/dejagnu/config/unix.exp as generic interface file 
for target.
WARNING: Couldn't find tool config file for unix, using default.

                 === g++ Summary ===

make[2]: Leaving directory `/home/lfs/newlfs/gcc-build/gcc'
make[1]: Target `do-check' not remade because of errors.
make[1]: Leaving directory `/home/lfs/newlfs/gcc-build'
make: *** [check] Error 2
-- 
Unsubscribe: send email to listar at linuxfromscratch.org
and put 'unsubscribe lfs-dev' in the subject header of the message



More information about the lfs-dev mailing list