chapter 5, GCC PASS 2

Axel axel.azerty at netcourrier.com
Wed May 21 03:23:11 PDT 2003


I don' t know the current state of the cvs or if this new method should be
ok for most of people, but I tried it though, on a REDHAT 8 host system.
here s the log of errors I get at gcc pass 2, while make -k check.
Missed I something ?
Thanks

Axel


****************************************
bash-2.05b$ make -k check

Native configuration is i686-pc-linux-gnu

                === libstdc++-v3 tests ===

Schedule of variations:
    unix

Running target unix
Using /stage1/share/dejagnu/baseboards/unix.exp as board description file for target.
Using /stage1/share/dejagnu/config/unix.exp as generic interface file for target.
Using /home/lfs/gcc-3.2.3/libstdc++-v3/testsuite/config/default.exp as tool-and-target-specific interface file.
Running /home/lfs/gcc-3.2.3/libstdc++-v3/testsuite/libstdc++-v3.dg/dg.exp ...
XPASS: 22_locale/collate_byname.cc execution test
XPASS: 22_locale/collate_members_char.cc execution test
XPASS: 22_locale/collate_members_wchar_t.cc execution test
XPASS: 22_locale/ctype_is_char.cc execution test
XPASS: 22_locale/ctype_is_wchar_t.cc execution test
XPASS: 22_locale/members.cc execution test
XPASS: 22_locale/messages_byname.cc execution test
XPASS: 22_locale/messages_members_char.cc execution test
XPASS: 22_locale/money_get_members_char.cc execution test
XPASS: 22_locale/money_get_members_wchar_t.cc execution test
XPASS: 22_locale/money_put_members_char.cc execution test
XPASS: 22_locale/money_put_members_wchar_t.cc execution test
XPASS: 22_locale/moneypunct_byname.cc execution test
XPASS: 22_locale/moneypunct_members_char.cc execution test
XPASS: 22_locale/moneypunct_members_wchar_t.cc execution test
XPASS: 22_locale/num_get_members_char.cc execution test
XPASS: 22_locale/num_get_members_wchar_t.cc execution test
XPASS: 22_locale/num_put_members_char.cc execution test
XPASS: 22_locale/num_put_members_wchar_t.cc execution test
XPASS: 22_locale/numpunct_byname.cc execution test
XPASS: 22_locale/numpunct_members_char.cc execution test
XPASS: 22_locale/numpunct_members_wchar_t.cc execution test
XPASS: 22_locale/time_get_members_char.cc execution test
XPASS: 22_locale/time_get_members_wchar_t.cc execution test
XPASS: 22_locale/time_put_members_char.cc execution test
XPASS: 22_locale/time_put_members_wchar_t.cc execution test
FAIL: 26_numerics/c99_classification_macros_c.cc (test for excess errors)

                === libstdc++-v3 Summary ===

# of expected passes            432
# of unexpected failures        1
# of unexpected successes       26
make[4]: *** [check-DEJAGNU] Error 1
make[4]: Leaving directory `/home/lfs/gcc-build/i686-pc-linux-gnu/libstdc++-v3/testsuite'
make[3]: *** [check-am] Error 2
make[3]: Target `check' not remade because of errors.
make[3]: Leaving directory `/home/lfs/gcc-build/i686-pc-linux-gnu/libstdc++-v3/testsuite'
make[3]: Entering directory `/home/lfs/gcc-build/i686-pc-linux-gnu/libstdc++-v3'
make[3]: Nothing to be done for `check-am'.
make[3]: Leaving directory `/home/lfs/gcc-build/i686-pc-linux-gnu/libstdc++-v3'
make[2]: *** [check-recursive] Error 1
make[2]: Target `check' not remade because of errors.
make[2]: Leaving directory `/home/lfs/gcc-build/i686-pc-linux-gnu/libstdc++-v3'
make[1]: *** [check-target-libstdc++-v3] Error 2
make[2]: Entering directory `/home/lfs/gcc-build/i686-pc-linux-gnu/libiberty'
make[3]: Entering directory `/home/lfs/gcc-build/i686-pc-linux-gnu/libiberty/testsuite'
make[3]: Nothing to be done for `check'.
make[3]: Leaving directory `/home/lfs/gcc-build/i686-pc-linux-gnu/libiberty/testsuite'
make[2]: Leaving directory `/home/lfs/gcc-build/i686-pc-linux-gnu/libiberty'
make[2]: Entering directory `/home/lfs/gcc-build/gcc'
(rootme=`pwd`; export rootme; \
srcdir=`cd ../../gcc-3.2.3/gcc; pwd` ; export srcdir ; \
cd testsuite; \
EXPECT=expect ; export EXPECT ; \
if [ -f ${rootme}/../expect/expect ] ; then  \
   TCL_LIBRARY=`cd .. ; cd ../../gcc-3.2.3/gcc/../tcl/library ; pwd` ; \
   export TCL_LIBRARY ; fi ; \
runtest --tool gcc )
WARNING: Couldn't find the global config file.
Test Run By lfs on Wed May 21 09:57:22 2003
Native configuration is i686-pc-linux-gnu

                === gcc tests ===

Schedule of variations:
    unix

Running target unix
Using /stage1/share/dejagnu/baseboards/unix.exp as board description file for target.
Using /stage1/share/dejagnu/config/unix.exp as generic interface file for target.
Using /home/lfs/gcc-3.2.3/gcc/testsuite/config/default.exp as tool-and-target-specific interface file.
Running /home/lfs/gcc-3.2.3/gcc/testsuite/gcc.c-torture/compile/compile.exp ...
Running /home/lfs/gcc-3.2.3/gcc/testsuite/gcc.c-torture/execute/execute.exp ...
Running /home/lfs/gcc-3.2.3/gcc/testsuite/gcc.c-torture/execute/ieee/ieee.exp ...
Running /home/lfs/gcc-3.2.3/gcc/testsuite/gcc.c-torture/execute/ieee/ieee.exp ...
Running /home/lfs/gcc-3.2.3/gcc/testsuite/gcc.c-torture/unsorted/unsorted.exp ...
Running /home/lfs/gcc-3.2.3/gcc/testsuite/gcc.dg/cpp/cpp.exp ...
Running /home/lfs/gcc-3.2.3/gcc/testsuite/gcc.dg/debug/debug.exp ...
Running /home/lfs/gcc-3.2.3/gcc/testsuite/gcc.dg/dg.exp ...
Running /home/lfs/gcc-3.2.3/gcc/testsuite/gcc.dg/format/format.exp ...
Running /home/lfs/gcc-3.2.3/gcc/testsuite/gcc.dg/noncompile/noncompile.exp ...
Running /home/lfs/gcc-3.2.3/gcc/testsuite/gcc.dg/special/ecos.exp ...
Running /home/lfs/gcc-3.2.3/gcc/testsuite/gcc.dg/special/special.exp ...
Running /home/lfs/gcc-3.2.3/gcc/testsuite/gcc.misc-tests/acker1.exp ...
Running /home/lfs/gcc-3.2.3/gcc/testsuite/gcc.misc-tests/arm-isr.exp ...
Running /home/lfs/gcc-3.2.3/gcc/testsuite/gcc.misc-tests/bprob.exp ...
Running /home/lfs/gcc-3.2.3/gcc/testsuite/gcc.misc-tests/dg-test.exp ...
Running /home/lfs/gcc-3.2.3/gcc/testsuite/gcc.misc-tests/dhry.exp ...
Running /home/lfs/gcc-3.2.3/gcc/testsuite/gcc.misc-tests/gcov.exp ...
Running /home/lfs/gcc-3.2.3/gcc/testsuite/gcc.misc-tests/i386-prefetch.exp ...
Running /home/lfs/gcc-3.2.3/gcc/testsuite/gcc.misc-tests/linkage.exp ...
Running /home/lfs/gcc-3.2.3/gcc/testsuite/gcc.misc-tests/matrix1.exp ...
Running /home/lfs/gcc-3.2.3/gcc/testsuite/gcc.misc-tests/mg.exp ...
Running /home/lfs/gcc-3.2.3/gcc/testsuite/gcc.misc-tests/sieve.exp ...
Running /home/lfs/gcc-3.2.3/gcc/testsuite/gcc.misc-tests/sort2.exp ...

                === gcc Summary ===

# of expected passes            19027
# of expected failures          68
# of unsupported tests          49
/home/lfs/gcc-build/gcc/xgcc version 3.2.3


if (autogen --ver=v) > /dev/null 2>&1 ; \
then cd fixinc && make check ; \
else true ; fi
(rootme=`pwd`; export rootme; \
srcdir=`cd ../../gcc-3.2.3/gcc; pwd` ; export srcdir ; \
cd testsuite; \
EXPECT=expect ; export EXPECT ; \
if [ -f ${rootme}/../expect/expect ] ; then  \
   TCL_LIBRARY=`cd .. ; cd ../../gcc-3.2.3/gcc/../tcl/library ; pwd` ; \
    export TCL_LIBRARY ; fi ; \
runtest --tool g++ )
WARNING: Couldn't find the global config file.
Test Run By lfs on Wed May 21 10:14:44 2003
Native configuration is i686-pc-linux-gnu

                === g++ tests ===

Schedule of variations:
    unix


Running target unix
Using /stage1/share/dejagnu/baseboards/unix.exp as board description file for target.
Using /stage1/share/dejagnu/config/unix.exp as generic interface file for target.
Using /home/lfs/gcc-3.2.3/gcc/testsuite/config/default.exp as tool-and-target-specific interface file.
Running /home/lfs/gcc-3.2.3/gcc/testsuite/g++.dg/debug/debug.exp ...
Running /home/lfs/gcc-3.2.3/gcc/testsuite/g++.dg/dg.exp ...
Running /home/lfs/gcc-3.2.3/gcc/testsuite/g++.dg/special/ecos.exp ...
Running /home/lfs/gcc-3.2.3/gcc/testsuite/g++.old-deja/old-deja.exp ...
XPASS: g++.other/init5.C  Execution test

                === g++ Summary ===

# of expected passes            7378
# of unexpected successes       1
# of expected failures          88
# of untested testcases         9
# of unsupported tests          3
/home/lfs/gcc-build/gcc/testsuite/../g++ version 3.2.3


make[2]: [check-g++] Error 1 (ignored)
make[2]: Leaving directory `/home/lfs/gcc-build/gcc'
-bash-2.05b$

-- 
Unsubscribe: send email to listar at linuxfromscratch.org
and put 'unsubscribe lfs-dev' in the subject header of the message



More information about the lfs-dev mailing list