gcc build fails

Christian Schmitt chrissschmitt at web.de
Sat Jul 10 09:50:07 PDT 2004


Hi,

i'm testing the current svn testing branch and I encounter an error in 
chapter 5 GCC-3.4.1 - Pass 2. The error message is as follows:

Making all in testsuite
make[3]: Entering directory 
`/mnt/lfs/tools/src/gcc-build/i686-pc-linux-gnu/libstdc++-v3/testsuite'
touch testsuite_wchar_t
/mnt/lfs/tools/src/gcc-3.4.1/libstdc++-v3/scripts/create_testsuite_files \
   /mnt/lfs/tools/src/gcc-3.4.1/libstdc++-v3/testsuite `${PWDCMD-pwd}`
/bin/sh: line 1: 
/mnt/lfs/tools/src/gcc-3.4.1/libstdc++-v3/scripts/create_testsuite_files: 
Permission denied
make[3]: *** [testsuite_files] Error 126
make[3]: Leaving directory 
`/mnt/lfs/tools/src/gcc-build/i686-pc-linux-gnu/libstdc++-v3/testsuite'
make[2]: *** [all-recursive] Error 1
make[2]: Leaving directory 
`/mnt/lfs/tools/src/gcc-build/i686-pc-linux-gnu/libstdc++-v3'
make[1]: *** [all] Error 2
make[1]: Leaving directory 
`/mnt/lfs/tools/src/gcc-build/i686-pc-linux-gnu/libstdc++-v3'
make: *** [all-target-libstdc++-v3] Error 2
lfs:/mnt/lfs/tools/src/gcc-build$

I'm not able to figure out where the problem is. Any suggestions?

Chris



More information about the lfs-dev mailing list