Glibc testsuite errors

Randy McMurchy randy at linuxfromscratch.org
Mon Feb 5 16:38:24 PST 2007


Hi all,

Just an FYI, but I had errors building Glibc in chapter 6 of the dev
book, which I've not seen before. Doesn't seem to be a great big deal,
but they are unusual for me on this system.

rml at rmlinux: /mnt/rml3/build/glibc-build > grep Error check.log

make[2]: *** [/build/glibc-build/dlfcn/bug-atexit3.out] Error 1
make[1]: *** [dlfcn/tests] Error 2
make[2]: [/build/glibc-build/posix/annexc.out] Error 1 (ignored)
make[2]: *** [/build/glibc-build/nptl/tst-cancel1.out] Error 1
make[2]: *** [/build/glibc-build/nptl/tst-cancel24.out] Error 127
make[1]: *** [nptl/tests] Error 2
make: *** [check] Error 2

-- 
Randy

rmlscsi: [bogomips 1003.26] [GNU ld version 2.16.1] [gcc (GCC) 4.0.3]
[GNU C Library stable release version 2.3.6] [Linux 2.6.14.3 i686]
18:35:00 up 26 days, 18:49, 1 user, load average: 0.06, 0.03, 0.00



More information about the lfs-dev mailing list