glibc-2.10.1 make check fails

Trent Shea trent.shea at gmail.com
Sun May 24 20:04:25 PDT 2009


On Sunday 24 May 2009 16:31:12 Trent Shea wrote:
> but I do believe these are the exact failures I
> had.

I was mistaken. The errors I had with the 6.4 build were:

grep Error ./test-logs/068-glibc
make[3]: [/sources/glibc-build/posix/annexc.out] Error 1 (ignored)
make[3]: *** [/sources/glibc-build/rt/tst-cpuclock2.out] Error 1
make[2]: *** [rt/tests] Error 2
make[1]: *** [check] Error 2


Trent.



More information about the lfs-dev mailing list