Glibc 2.3.2 make error

Markus Bender markus.bender
Sat May 8 08:59:49 PDT 2004


Kevin P. Fleming wrote:

> You've not posted the actual error that occurred, only the last line. We
> need the log going to back to where the actual error occurred to be able
> to help.
> 
> When you reply, please also include what host you are building on
> (distribution, version, etc.).

Sorry for that:

...
/tools/lib/gcc-lib/i686-pc-linux-gnu/3.3.1/include -isystem /tools/include
-D_LIBC_REENTRANT -include ../include/libc-symbols.h       -DHAVE_INITFINI
-o /mnt/lfs/sources/glibc-build/csu/init-first.o
In file included from ../sysdeps/unix/sysdep.h:21,
                 from ../sysdeps/unix/i386/sysdep.h:19,
                 from ../sysdeps/unix/sysv/linux/i386/sysdep.h:24,
                 from ../sysdeps/unix/sysv/linux/init-first.c:24:
../sysdeps/unix/sysv/linux/sys/syscall.h:25:24: asm/unistd.h: No such file
or directory
In file included from ../sysdeps/unix/sysv/linux/sys/param.h:24,
                 from ../sysdeps/unix/sysv/linux/init-first.c:26:
/tools/include/linux/param.h:4:23: asm/param.h: No such file or directory
In file included from ../signal/signal.h:313,
                 from ../include/signal.h:5,
                 from ../linuxthreads/internals.h:23,
                 from ../linuxthreads/sysdeps/pthread/bits/libc-lock.h:27,
                 from ../sysdeps/generic/ldsodefs.h:38,
                 from ../sysdeps/unix/sysv/linux/ldsodefs.h:25,
                 from ../sysdeps/unix/sysv/linux/init-first.c:30:
../sysdeps/unix/sysv/linux/bits/sigcontext.h:28:29: asm/sigcontext.h: No
such file or directory
In file included from ../include/signal.h:5,
                 from ../linuxthreads/internals.h:23,
                 from ../linuxthreads/sysdeps/pthread/bits/libc-lock.h:27,
                 from ../sysdeps/generic/ldsodefs.h:38,
                 from ../sysdeps/unix/sysv/linux/ldsodefs.h:25,
                 from ../sysdeps/unix/sysv/linux/init-first.c:30:
../signal/signal.h:316: warning: `struct sigcontext' declared inside
parameter list
../signal/signal.h:316: warning: its scope is only this definition or
declaration, which is probably not what you want
In file included from ../linuxthreads/internals.h:23,
                 from ../linuxthreads/sysdeps/pthread/bits/libc-lock.h:27,
                 from ../sysdeps/generic/ldsodefs.h:38,
                 from ../sysdeps/unix/sysv/linux/ldsodefs.h:25,
                 from ../sysdeps/unix/sysv/linux/init-first.c:30:
../include/signal.h:38: warning: `struct sigcontext' declared inside
parameter list
In file included from ../inet/netinet/in.h:212,
                 from ../include/netinet/in.h:3,
                 from ../resolv/resolv.h:57,
                 from ../include/resolv.h:11,
                 from ../linuxthreads/descr.h:19,
                 from ../linuxthreads/internals.h:29,
                 from ../linuxthreads/sysdeps/pthread/bits/libc-lock.h:27,
                 from ../sysdeps/generic/ldsodefs.h:38,
                 from ../sysdeps/unix/sysv/linux/ldsodefs.h:25,
                 from ../sysdeps/unix/sysv/linux/init-first.c:30:
../sysdeps/unix/sysv/linux/bits/socket.h:305:24: asm/socket.h: No such file
or directory
In file included from ../linuxthreads/sysdeps/pthread/bits/libc-lock.h:27,
                 from ../sysdeps/generic/ldsodefs.h:38,
                 from ../sysdeps/unix/sysv/linux/ldsodefs.h:25,
                 from ../sysdeps/unix/sysv/linux/init-first.c:30:
../linuxthreads/internals.h:108: warning: `struct sigcontext' declared
inside parameter list
../linuxthreads/internals.h:108: warning: parameter has incomplete type
../linuxthreads/internals.h:449: warning: `struct sigcontext' declared
inside parameter list
../linuxthreads/internals.h:449: warning: parameter has incomplete type
../stdio-common/_itoa.h:40: warning: inlining failed in call to `_itoa_word'
../stdio-common/_itoa.h:76: warning: called from here
make[2]: *** [/mnt/lfs/sources/glibc-build/csu/init-first.o] Error 1
make[2]: Leaving directory `/mnt/lfs/sources/glibc-2.3.2/csu'
make[1]: *** [csu/subdir_lib] Error 2
make[1]: Leaving directory `/mnt/lfs/sources/glibc-2.3.2'
make: *** [all] Error 2


I am trying to build on a SuSE Linux Version 9.0 Linux Kernel
2.4.21-99-athlon.

Thank you.
Greets Markus



More information about the lfs-support mailing list