binutils-2.15.94.0.2.2 gas error

Peter Ennis peterennis at yahoo.com
Fri Apr 29 22:57:51 PDT 2005


Running host FC4 Test3 with latest patches
and trying to build Version SVN-20050417.
Bombs at the first fence :-(
I know, bleeding edge ...

ict-prototypes -Wmissing-prototypes -g -O2 -c
../../binutils-2.15.94.0.2.2/gas/app.c
In file included from ./targ-cpu.h:1,
                 from
../../binutils-2.15.94.0.2.2/gas/config/obj-elf.h:42,
                 from ./obj-format.h:1,
                 from
../../binutils-2.15.94.0.2.2/gas/config/te-linux.h:4,
                 from ./targ-env.h:1,
                 from ../../binutils-2.15.94.0.2.2/gas/as.h:625,
                 from ../../binutils-2.15.94.0.2.2/gas/app.c:30:
../../binutils-2.15.94.0.2.2/gas/config/tc-i386.h:443: error: array
type has incomplete element type
make[3]: *** [app.o] Error 1
make[3]: Leaving directory `/home/lfs/binutils-build/gas'
make[2]: *** [all-recursive] Error 1
make[2]: Leaving directory `/home/lfs/binutils-build/gas'
make[1]: *** [all] Error 2
make[1]: Leaving directory `/home/lfs/binutils-build/gas'
make: *** [all-gas] Error 2
lfs:~/binutils-build$

google returns:
http://www.mail-archive.com/bug-binutils@gnu.org/msg00111.html
which says it is fixed but no reference.
Could not find anything searching lfs-dev

Is the best way forward the latest binutils and
latest lfs book?
I want to follow the LFS 6.1.x track

thanks

PFE








More information about the lfs-support mailing list