Ch 6 head-scratcher...

Jaco Greeff jacogr at gmail.com
Mon May 2 03:59:27 PDT 2005


Hi all,

I seem to have run into a brick wall in Ch 6, whereas my building of
binutils seems very unhappy when I run the tests... does anybody have
an idea of what I might have missed? (Failure follows.)

Jaco

---

Native configuration is i686-pc-linux-gnu

                === binutils tests ===

Schedule of variations:
    unix

Running target unix
Using /tools/share/dejagnu/baseboards/unix.exp as board description
file for target.
Using /tools/share/dejagnu/config/unix.exp as generic interface file for target.
Using /tools/usr/src/lfs/build/binutils-2.15.94.0.2.2/binutils/testsuite/config/default.exp
as tool-and-target-specific interface file.
file isfile ../gas/as-new: 1
Running /tools/usr/src/lfs/build/binutils-2.15.94.0.2.2/binutils/testsuite/binutils-all/ar.exp
...
FAIL: ar long file names
ERROR: /tools/usr/src/lfs/build/binutils-2.15.94.0.2.2/binutils/testsuite/binutils-all/bintest.s:
assembly failed
ERROR: /tools/usr/src/lfs/build/binutils-2.15.94.0.2.2/binutils/testsuite/binutils-all/bintest.s:
assembly failed
Running /tools/usr/src/lfs/build/binutils-2.15.94.0.2.2/binutils/testsuite/binutils-all/dlltool.exp
...
Running /tools/usr/src/lfs/build/binutils-2.15.94.0.2.2/binutils/testsuite/binutils-all/hppa/objdump.exp
...
Running /tools/usr/src/lfs/build/binutils-2.15.94.0.2.2/binutils/testsuite/binutils-all/m68k/objdump.exp
...
Running /tools/usr/src/lfs/build/binutils-2.15.94.0.2.2/binutils/testsuite/binutils-all/nm.exp
...
Version /tools/usr/src/lfs/build/binutils-build/binutils/nm-new failed
ERROR: /tools/usr/src/lfs/build/binutils-2.15.94.0.2.2/binutils/testsuite/binutils-all/bintest.s:
assembly failed
Running /tools/usr/src/lfs/build/binutils-2.15.94.0.2.2/binutils/testsuite/binutils-all/objcopy.exp
...
Version /tools/usr/src/lfs/build/binutils-build/binutils/objcopy failed
ERROR: /tools/usr/src/lfs/build/binutils-2.15.94.0.2.2/binutils/testsuite/binutils-all/bintest.s:
assembly failed
ERROR: unresolved 1
Running /tools/usr/src/lfs/build/binutils-2.15.94.0.2.2/binutils/testsuite/binutils-all/objdump.exp
...
Version /tools/usr/src/lfs/build/binutils-build/binutils/objdump failed
FAIL: objdump -i
ERROR: /tools/usr/src/lfs/build/binutils-2.15.94.0.2.2/binutils/testsuite/binutils-all/bintest.s:
assembly failed
Running /tools/usr/src/lfs/build/binutils-2.15.94.0.2.2/binutils/testsuite/binutils-all/readelf.exp
...
Version /tools/usr/src/lfs/build/binutils-build/binutils/readelf failed
ERROR: /tools/usr/src/lfs/build/binutils-2.15.94.0.2.2/binutils/testsuite/binutils-all/bintest.s:
assembly failed
ERROR: unresolved 1
Running /tools/usr/src/lfs/build/binutils-2.15.94.0.2.2/binutils/testsuite/binutils-all/size.exp
...
Version /tools/usr/src/lfs/build/binutils-build/binutils/size failed
ERROR: /tools/usr/src/lfs/build/binutils-2.15.94.0.2.2/binutils/testsuite/binutils-all/bintest.s:
assembly failed
Running /tools/usr/src/lfs/build/binutils-2.15.94.0.2.2/binutils/testsuite/binutils-all/windres/windres.exp
...

                === binutils Summary ===

# of unexpected failures        2
# of unresolved testcases       4
make[3]: *** [check-DEJAGNU] Error 1
make[3]: Leaving directory `/tools/usr/src/lfs/build/binutils-build/binutils'
make[2]: *** [check-am] Error 2
make[2]: Leaving directory `/tools/usr/src/lfs/build/binutils-build/binutils'
make[1]: *** [check-recursive] Error 1
make[1]: Leaving directory `/tools/usr/src/lfs/build/binutils-build/binutils'
make: *** [check-binutils] Error 2



More information about the lfs-support mailing list