stuck at glibc-2.3.4

Asif Baloch balochster at gmail.com
Sat May 7 14:33:34 PDT 2005


Here is the output form config.log. One thing more, do i have to
upgrade the kernel to 2.6.8.1 or will it work on the default kernel
that comes with Redhat 9, its 2.4.x.

-----------start---------

This file contains any messages produced by compilers while
running configure, to aid debugging if configure makes a mistake.

It was created by GNU C Library configure (see version.h), which was
generated by GNU Autoconf 2.59.  Invocation command line was

  $ glibc-2.3.4-20040701/configure

## --------- ##
## Platform. ##
## --------- ##

hostname = mafia
uname -m = i686
uname -r = 2.4.20-8smp
uname -s = Linux
uname -v = #1 SMP Thu Mar 13 17:45:54 EST 2003

/usr/bin/uname -p = unknown
/bin/uname -X     = unknown

/bin/arch              = i686
/usr/bin/arch -k       = unknown
/usr/convex/getsysinfo = unknown
hostinfo               = unknown
/bin/machine           = unknown
/usr/bin/oslevel       = unknown
/bin/universe          = unknown

PATH: /tools/bin
PATH: /bin
PATH: /usr/bin


## ----------- ##
## Core tests. ##
## ----------- ##

configure:1740: checking build system type
configure:1758: result: i686-pc-linux-gnu
configure:1766: checking host system type
configure:1780: result: i686-pc-linux-gnu
configure:1949: checking sysdep dirs
configure:2163: result: sysdeps/generic/elf sysdeps/generic
configure:2182: checking for a BSD-compatible install
configure:2237: result: /usr/bin/install -c
configure:2252: checking whether ln -s works
configure:2256: result: yes
configure:2310: checking for gcc
configure:2326: found /tools/bin/gcc
configure:2336: result: gcc
configure:2580: checking for C compiler version
configure:2583: gcc --version </dev/null >&5
gcc (GCC) 3.4.1
Copyright (C) 2004 Free Software Foundation, Inc.
This is free software; see the source for copying conditions.  There is NO
warranty; not even for MERCHANTABILITY or FITNESS FOR A PARTICULAR PURPOSE.

configure:2586: $? = 0
configure:2588: gcc -v </dev/null >&5
Reading specs from /mnt/lfs/tools/bin/../lib/gcc/i686-pc-linux-gnu/3.4.1/specs
Configured with: ./configure --prefix=/tools --libexecdir=/tools/lib
--with-local-prefix=/tools --disable-nls --enable-shared
--enable-languag
es=c
Thread model: posix
gcc version 3.4.1
configure:2591: $? = 0
configure:2593: gcc -V </dev/null >&5
gcc: `-V' option must have argument
configure:2596: $? = 1
configure:2600: checking for suffix of object files
configure:2621: gcc -c   conftest.c >&5
configure:2624: $? = 0
configure:2646: result: o
configure:2650: checking whether we are using the GNU C compiler
configure:2674: gcc -c   conftest.c >&5
configure:2680: $? = 0
configure:2684: test -z
                         || test ! -s conftest.err
configure:2687: $? = 0
configure:2690: test -s conftest.o
configure:2693: $? = 0
configure:2706: result: yes
configure:2712: checking whether gcc accepts -g
configure:2733: gcc -c -g  conftest.c >&5
configure:2739: $? = 0
configure:2743: test -z
                         || test ! -s conftest.err
configure:2746: $? = 0
configure:2749: test -s conftest.o
configure:2752: $? = 0
configure:2763: result: yes
configure:2780: checking for gcc option to accept ANSI C
configure:2850: gcc  -c -g -O2  conftest.c >&5
configure:2856: $? = 0
configure:2860: test -z
                         || test ! -s conftest.err
configure:2863: $? = 0
configure:2866: test -s conftest.o
configure:2869: $? = 0
configure:2887: result: none needed
configure:2905: gcc -c -g -O2  conftest.c >&5
conftest.c:2: error: parse error before "me"
configure:2911: $? = 1
configure: failed program was:
| #ifndef __cplusplus
|   choke me
| #endif
configure:3092: checking how to run the C preprocessor
configure:3127: gcc -E  conftest.c
configure:3133: $? = 0
configure:3165: gcc -E  conftest.c
conftest.c:10:28: ac_nonexistent.h: No such file or directory
configure:3171: $? = 1
configure: failed program was:
| /* confdefs.h.  */
|
| #define PACKAGE_NAME "GNU C Library"
| #define PACKAGE_TARNAME "c-library"
| #define PACKAGE_VERSION "(see version.h)"
| #define PACKAGE_STRING "GNU C Library (see version.h)"
| #define PACKAGE_BUGREPORT "glibc"
| #define USE_REGPARMS 1
| /* end confdefs.h.  */
| #include <ac_nonexistent.h>
configure:3210: result: gcc -E
configure:3234: gcc -E  conftest.c
configure:3240: $? = 0
configure:3272: gcc -E  conftest.c
conftest.c:10:28: ac_nonexistent.h: No such file or directory
configure:3278: $? = 1
configure: failed program was:
| /* confdefs.h.  */
|
| #define PACKAGE_NAME "GNU C Library"
| #define PACKAGE_TARNAME "c-library"
| #define PACKAGE_VERSION "(see version.h)"
| #define PACKAGE_STRING "GNU C Library (see version.h)"
| #define PACKAGE_BUGREPORT "glibc"
| #define USE_REGPARMS 1
| /* end confdefs.h.  */
| #include <ac_nonexistent.h>
configure:3374: checking for g++
configure:3390: found /usr/bin/g++
configure:3400: result: g++
configure:3416: checking for C++ compiler version
configure:3419: g++ --version </dev/null >&5
g++ (GCC) 3.2.2 20030222 (Red Hat Linux 3.2.2-5)
Copyright (C) 2002 Free Software Foundation, Inc.
This is free software; see the source for copying conditions.  There is NO
warranty; not even for MERCHANTABILITY or FITNESS FOR A PARTICULAR PURPOSE.

configure:3422: $? = 0
configure:3424: g++ -v </dev/null >&5
Reading specs from /usr/lib/gcc-lib/i386-redhat-linux/3.2.2/specs
Configured with: ../configure --prefix=/usr --mandir=/usr/share/man
--infodir=/usr/share/info --enable-shared --enable-threads=posix
--disable
-checking --with-system-zlib --enable-__cxa_atexit --host=i386-redhat-linux
Thread model: posix
gcc version 3.2.2 20030222 (Red Hat Linux 3.2.2-5)
configure:3427: $? = 0
configure:3429: g++ -V </dev/null >&5
g++: argument to `-V' missing

configure:3432: $? = 1
configure:3435: checking whether we are using the GNU C++ compiler
configure:3459: g++ -c   conftest.cc >&5
configure:3465: $? = 0
configure:3469: test -z
                         || test ! -s conftest.err
configure:3472: $? = 0
configure:3475: test -s conftest.o
configure:3478: $? = 0
configure:3491: result: yes
configure:3497: checking whether g++ accepts -g
configure:3518: g++ -c -g  conftest.cc >&5
configure:3524: $? = 0
configure:3528: test -z
                         || test ! -s conftest.err
configure:3531: $? = 0
configure:3534: test -s conftest.o
configure:3537: $? = 0
configure:3548: result: yes
configure:3590: g++ -c -g -O2  conftest.cc >&5
configure:3596: $? = 0
configure:3600: test -z
                         || test ! -s conftest.err
configure:3603: $? = 0
configure:3606: test -s conftest.o
configure:3609: $? = 0
configure:3635: g++ -c -g -O2  conftest.cc >&5
conftest.cc: In function `int main()':
conftest.cc:14: `exit' undeclared (first use this function)
conftest.cc:14: (Each undeclared identifier is reported only once for each
   function it appears in.)
configure:3641: $? = 1
configure: failed program was:
| /* confdefs.h.  */
|
| #define PACKAGE_NAME "GNU C Library"
| #define PACKAGE_TARNAME "c-library"
| #define PACKAGE_VERSION "(see version.h)"
| #define PACKAGE_STRING "GNU C Library (see version.h)"
| #define PACKAGE_BUGREPORT "glibc"
| #define USE_REGPARMS 1
| /* end confdefs.h.  */
|
| int
| main ()
| {
| exit (42);
|   ;
|   return 0;
| }
configure:3590: g++ -c -g -O2  conftest.cc >&5
configure:3596: $? = 0
configure:3600: test -z
                         || test ! -s conftest.err
configure:3603: $? = 0
configure:3606: test -s conftest.o
configure:3609: $? = 0
configure:3635: g++ -c -g -O2  conftest.cc >&5
configure:3641: $? = 0
configure:3645: test -z
                         || test ! -s conftest.err
configure:3648: $? = 0
configure:3651: test -s conftest.o
configure:3654: $? = 0
configure:3736: checking for ranlib
configure:3752: found /usr/bin/ranlib
configure:3763: result: ranlib
configure:3781: checking whether as is GNU as
configure:3795: result: yes
configure:3800: checking whether ld is GNU ld
configure:3814: result: yes
configure:3824: checking for as
configure:3850: result: as
configure:3864: checking version of as
configure:3874: result: 2.13.90.0.18, ok
configure:3885: checking for ld
configure:3911: result: ld
configure:3925: checking version of ld
configure:3935: result: 2.13.90.0.18, ok
configure:3950: checking for pwd
configure:3968: found /bin/pwd
configure:3981: result: /bin/pwd
configure:4000: checking for gcc
configure:4026: result: gcc
configure:4040: checking version of gcc
configure:4050: result: 3.4.1, ok
configure:4061: checking for gnumake
configure:4090: result: no
configure:4061: checking for gmake
configure:4077: found /usr/bin/gmake
configure:4087: result: gmake
configure:4101: checking version of gmake
configure:4111: result: 3.79.1, ok
configure:4123: checking for gnumsgfmt
configure:4152: result: no
configure:4123: checking for gmsgfmt
configure:4152: result: no
configure:4123: checking for msgfmt
configure:4139: found /usr/bin/msgfmt
configure:4149: result: msgfmt
configure:4163: checking version of msgfmt
configure:4173: result: 0.11.4, ok
configure:4184: checking for makeinfo
configure:4200: found /usr/bin/makeinfo
configure:4210: result: makeinfo
configure:4224: checking version of makeinfo
configure:4234: result: 4.3, ok
configure:4245: checking for sed
configure:4261: found /bin/sed
configure:4271: result: sed
configure:4285: checking version of sed
configure:4295: result: 4.0.5, okconfigure:4307: checking for autoconf
configure:4323: found /usr/bin/autoconf
configure:4333: result: autoconf
configure:4347: checking whether autoconf works
configure:4358: result: yes
configure:4395: checking whether ranlib is necessary
configure:4416: result: no
configure:4429: checking LD_LIBRARY_PATH variable
configure:4439: result: ok
configure:4453: checking whether GCC supports -static-libgcc
configure:4464: result: -static-libgcc
configure:4470: checking for bash
configure:4501: result: /bin/sh
configure:4574: checking for gawk
configure:4590: found /bin/gawk
configure:4600: result: gawk
configure:4612: checking for perl
configure:4630: found /usr/bin/perl
configure:4643: result: /usr/bin/perl
configure:4656: checking for install-info
configure:4675: found /sbin/install-info
configure:4688: result: /sbin/install-info
configure:4697: checking for bison
configure:4716: found /usr/bin/bison
configure:4729: result: /usr/bin/bison
configure:4737: checking for signed size_t type
configure:4752: result: no
configure:4762: checking for libc-friendly stddef.h
configure:4791: gcc -c -g -O2  conftest.c >&5
configure:4797: $? = 0
configure:4801: test -z
                         || test ! -s conftest.err
configure:4804: $? = 0
configure:4807: test -s conftest.o
configure:4810: $? = 0
configure:4821: result: yes
configure:4828: checking whether we need to use -P to assemble .S files
configure:4838: gcc   -c conftest.S 1>&5
configure:4841: $? = 0
configure:4849: result: no
configure:4856: checking whether .text pseudo-op must be used
configure:4866: gcc  -c conftest.s 1>&5
configure:4869: $? = 0
configure:4880: result: yes
configure:4884: checking for assembler global-symbol directive
configure:4897: gcc  -c conftest.s 1>&5
configure:4900: $? = 0
configure:4908: result: .globl
configure:4921: checking for .set assembler directive
configure:4947: result: yes
configure:4956: checking for assembler .type directive prefix
configure:4972: gcc  -c conftest.s 1>&5
configure:4975: $? = 0
configure:4983: result: @
configure:5002: checking for .symver assembler directive
configure:5019: result: yes
configure:5021: checking for ld --version-script
configure:5047: gcc -g -O2  -shared
                                -o conftest.so conftest.o
                                -nostartfiles -nostdlib
                                -Wl,--version-script,conftest.map
                       1>&5
configure:5050: $? = 0
configure:5065: result: yes
configure:5089: checking for .previous assembler directive
configure:5099: gcc -c  conftest.s 1>&5
configure:5102: $? = 0
configure:5110: result: yes
configure:5148: checking for .protected and .hidden assembler directive
configure:5160: gcc -c  conftest.s 1>&5
configure:5163: $? = 0
configure:5171: result: yes
configure:5184: checking whether __attribute__((visibility())) is supported
configure:5195: gcc -Werror -S conftest.c -o conftest.s 1>&5
configure:5198: $? = 0
configure:5209: result: yes
configure:5220: checking for broken __attribute__((visibility()))
configure:5232: gcc -Werror -S conftest.c -o conftest.s1>&5
configure:5235: $? = 0
configure:5244: result: no
configure:5254: checking for broken __attribute__((alias()))
configure:5269: gcc -Werror -S conftest.c -o conftest.s 1>&5
configure:5272: $? = 0
configure:5282: result: no
configure:5292: checking whether to put _rtld_local into .sdata section
configure:5306: result: no
configure:5316: checking for .preinit_array/.init_array/.fini_array support
configure:5329: gcc -g -O2   -o conftest conftest.c
                     -static -nostartfiles -nostdlib 1>&5
configure:5332: $? = 0
configure:5345: result: yes
configure:5355: checking for libunwind-support in compiler
configure:5380: gcc -o conftest -g -O2   conftest.c  >&5
conftest.c:22:23: libunwind.h: No such file or directory
conftest.c: In function `main':
conftest.c:27: error: `unw_context_t' undeclared (first use in this function)
conftest.c:27: error: (Each undeclared identifier is reported only once
conftest.c:27: error: for each function it appears in.)
conftest.c:27: error: parse error before "uc"
conftest.c:28: error: `unw_cursor_t' undeclared (first use in this function)
conftest.c:29: error: `uc' undeclared (first use in this function)
conftest.c:30: error: `c' undeclared (first use in this function)
configure:5386: $? = 1
configure: failed program was:
| /* confdefs.h.  */
|
| #define PACKAGE_NAME "GNU C Library"
| #define PACKAGE_TARNAME "c-library"
| #define PACKAGE_VERSION "(see version.h)"
| #define PACKAGE_STRING "GNU C Library (see version.h)"
| #define PACKAGE_BUGREPORT "glibc"
| #define USE_REGPARMS 1
| #ifdef __cplusplus
| extern "C" void std::exit (int) throw (); using std::exit;
| #endif
| #define ASM_GLOBAL_DIRECTIVE .globl
| #define HAVE_ASM_SET_DIRECTIVE 1
| #define ASM_TYPE_DIRECTIVE_PREFIX @
| #define DO_VERSIONING 1
| #define HAVE_ASM_PREVIOUS_DIRECTIVE 1
| #define HAVE_PROTECTED 1
| #define HAVE_HIDDEN 1
| #define HAVE_VISIBILITY_ATTRIBUTE 1
| #define HAVE_INITFINI_ARRAY 1
| /* end confdefs.h.  */
| #include <libunwind.h>
| int
| main ()
| {
|
|       unw_context_t uc;
|       unw_cursor_t c;
|       unw_getcontext (&uc);
|       unw_init_local (&c, &uc)
|   ;
|   return 0;
| }
configure:5411: result: no
configure:5421: checking for -z nodelete option
configure:5433: gcc -g -O2
                     -shared -o conftest.so conftest.c
                     -nostartfiles -nostdlib
                     -Wl,--enable-new-dtags,-z,nodelete 1>&5
configure:5436: $? = 0
configure:5445: result: yes
configure:5449: checking for -z nodlopen option
configure:5461: gcc -g -O2
                        -shared -o conftest.so conftest.c
                        -nostartfiles -nostdlib
                        -Wl,--enable-new-dtags,-z,nodlopen 1>&5
configure:5464: $? = 0
configure:5473: result: yes
configure:5477: checking for -z initfirst option
configure:5489: gcc -g -O2
                        -shared -o conftest.so conftest.c
                        -nostartfiles -nostdlib
                        -Wl,--enable-new-dtags,-z,initfirst 1>&5
configure:5492: $? = 0
configure:5501: result: yes
configure:5505: checking for -z relro option
configure:5511: gcc -v --help 2>&1|grep z relro 1>&5
configure:5514: $? = 1
configure:5522: result: no
configure:5532: checking for -Bgroup option
configure:5543: gcc -g -O2
                              -shared -o conftest.so conftest.c
                              -Wl,-Bgroup -nostdlib 1>&5
configure:5546: $? = 0
configure:5555: result: yes
configure:5559: checking for libgcc_s suffix
configure:5573: result:
configure:5577: checking for --as-needed option
configure:5589: gcc -g -O2
                              -shared -o conftest.so conftest.c
                              -lgcc_s -Wl,--as-needed
                              -nostdlib 1>&5
/usr/bin/ld: unrecognized option '--as-needed'
/usr/bin/ld: use the --help option for usage information
collect2: ld returned 1 exit status
configure:5592: $? = 1
configure:5601: result: no
configure:5606: checking whether --noexecstack is desirable for .S files
configure:5616: gcc -g -O2
                     -S -o conftest.s conftest.c 1>&5
configure:5619: $? = 0
configure:5624: gcc -g -O2  -Wa,--noexecstack
                       -c -o conftest.o conftest.s 1>&5
as: unrecognized option `--noexecstack'
configure:5627: $? = 1
configure:5636: result: no
configure:5643: checking for -z combreloc
configure:5657: gcc -g -O2
                        -shared -o conftest.so conftest.c
                        -nostdlib -nostartfiles
                        -Wl,-z,combreloc 1>&5
configure:5660: $? = 0
configure:5673: result: yes
configure:5683: checking for -z execstack
configure:5695: gcc -g -O2
                              -shared -o conftest.so conftest.c
                              -Wl,-z,execstack -nostdlib
                              1>&5
configure:5698: $? = 0
configure:5707: result: yes
configure:5711: checking for -fpie
configure:5722: gcc -g -O2   -pie -fpie
                              -o conftest conftest.c 1>&5
configure:5725: $? = 0
configure:5734: result: yes
configure:5740: checking for -fno-unit-at-a-time
configure:5750: gcc -g -O2  -S -fno-unit-at-a-time
                            conftest.c 1>&5
configure:5753: $? = 0
configure:5762: result: yes
configure:5834: checking whether cc puts quotes around section names
configure:5855: result: no
configure:5972: checking for assembler .weak directive
configure:5985: gcc  -c conftest.s 1>&5
configure:5988: $? = 0
configure:5996: result: yes
configure:6086: checking whether CFI directives are supported
configure:6101: gcc  -c conftest.s 1>&5
conftest.s: Assembler messages:
conftest.s:4: Error: unknown pseudo-op: `.cfi_startproc'
conftest.s:5: Error: unknown pseudo-op: `.cfi_remember_state'
conftest.s:6: Error: unknown pseudo-op: `.cfi_rel_offset'
conftest.s:7: Error: unknown pseudo-op: `.cfi_endproc'
configure:6104: $? = 1
configure:6112: result: no
configure:6121: checking if -g produces usable source locations for
assembler-with-cpp
configure:6144: gcc   -g -c conftest.S 1>&5
configure:6147: $? = 0
configure:6152: readelf --debug-dump=line conftest.o |
                   grep conftest\.S 1>&5
  1     0       0       0       conftest.S
configure:6155: $? = 0
configure:6163: result: yes
configure:6172: checking for ld --no-whole-archive
configure:6185: gcc -g -O2
                            -nostdlib -nostartfiles -Wl,--no-whole-archive
                            -o conftest conftest.c 1>&5
configure:6188: $? = 0
configure:6196: result: yes
configure:6202: checking for gcc -fexceptions
configure:6215: gcc -g -O2
                            -nostdlib -nostartfiles -fexceptions
                            -o conftest conftest.c 1>&5
configure:6218: $? = 0
configure:6226: result: yes
configure:6296: checking for DWARF2 unwind info support
configure:6334: gcc -g -O2  -DCHECK__register_frame_info              
                                     -nostdlib -nostartfiles -o
conftes
t conftest.c                        -lgcc >&5
configure:6316: warning: conflicting types for built-in function 'malloc'
configure:6318: warning: conflicting types for built-in function 'strlen'
configure:6319: warning: conflicting types for built-in function 'memcpy'
configure:6320: warning: conflicting types for built-in function 'memset'
configure:6322: warning: conflicting types for built-in function 'abort'
/tmp/cc4I0ccZ.o(.text+0xf): In function `_start':
/mnt/LFS/configure:6309: undefined reference to `__register_frame_info'
/tmp/cc4I0ccZ.o(.text+0x1c):/mnt/LFS/configure:6310: undefined
reference to `__deregister_frame_info'
collect2: ld returned 1 exit status
configure:6337: $? = 1
configure:6340: gcc -g -O2  -DCHECK__register_frame_info              
                                     -nostdlib -nostartfiles -o
conftes
t conftest.c                        -lgcc -lgcc_eh -lgcc >&5
configure:6316: warning: conflicting types for built-in function 'malloc'
configure:6318: warning: conflicting types for built-in function 'strlen'
configure:6319: warning: conflicting types for built-in function 'memcpy'
configure:6320: warning: conflicting types for built-in function 'memset'
configure:6322: warning: conflicting types for built-in function 'abort'
configure:6343: $? = 0
configure:6371: result: no_registry_needed
configure:6392: checking for __builtin_expect
configure:6407: gcc -g -O2   -nostdlib -nostartfiles
                            -o conftest conftest.c -lgcc >&5
/usr/bin/ld: warning: cannot find entry symbol _start; defaulting to 08048080
configure:6410: $? = 0
configure:6418: result: yes
configure:6427: checking for __builtin_memset
configure:6439: gcc -O3 -S conftest.c -o - | fgrep memset > /dev/null
configure:6442: $? = 0
configure:6451: result: no
configure:6460: checking for redirection of built-in functions
configure:6473: gcc -O3 -S conftest.c -o - | fgrep my_strstr > /dev/null
configure:6476: $? = 0
configure:6485: result: yes
configure:6494: checking for local label subtraction
configure:6514: gcc -g -O2   -nostdlib -nostartfiles
                            -o conftest conftest.c -lgcc >&5
/usr/bin/ld: warning: cannot find entry symbol _start; defaulting to 08048080
configure:6517: $? = 0
configure:6525: result: yes
configure:6535: checking for __thread
configure:6544: gcc -g -O2  -c conftest.c >&5
configure:6547: $? = 0
configure:6555: result: yes
configure:6568: checking for tls_model attribute
configure:6577: gcc -g -O2  -S -Werror conftest.c >&5
configure:6580: $? = 0
configure:6588: result: yes
configure:6598: checking for libgd
configure:6623: gcc -o conftest -g -O2     conftest.c  -lgd -lpng -lz -lm >&5
conftest.c:31:16: gd.h: No such file or directory
configure:6629: $? = 1
configure: failed program was:
| /* confdefs.h.  */
|
| #define PACKAGE_NAME "GNU C Library"
| #define PACKAGE_TARNAME "c-library"
| #define PACKAGE_VERSION "(see version.h)"
| #define PACKAGE_STRING "GNU C Library (see version.h)"
| #define PACKAGE_BUGREPORT "glibc"
| #define USE_REGPARMS 1
| #ifdef __cplusplus
| extern "C" void std::exit (int) throw (); using std::exit;
| #endif
| #define ASM_GLOBAL_DIRECTIVE .globl
| #define HAVE_ASM_SET_DIRECTIVE 1
| #define ASM_TYPE_DIRECTIVE_PREFIX @
| #define DO_VERSIONING 1
| #define HAVE_ASM_PREVIOUS_DIRECTIVE 1
| #define HAVE_PROTECTED 1
| #define HAVE_HIDDEN 1
| #define HAVE_VISIBILITY_ATTRIBUTE 1
| #define HAVE_INITFINI_ARRAY 1
| #define HAVE_Z_COMBRELOC 1
| #define NO_UNDERSCORES 1
| #define HAVE_ASM_WEAK_DIRECTIVE 1
| #define HAVE_CPP_ASM_DEBUGINFO 1
| #define HAVE_BUILTIN_EXPECT 1
| #define HAVE_BUILTIN_REDIRECTION 1
| #define HAVE_SUBTRACT_LOCAL_LABELS 1
| #define HAVE___THREAD 1
| #define HAVE_TLS_MODEL_ATTRIBUTE 1
| /* end confdefs.h.  */
| #include <gd.h>
| int
| main ()
| {
| gdImagePng (0, 0)
|   ;
|   return 0;
| }
configure:6659: result: no
configure:6664: checking for egrep
configure:6674: result: grep -E
configure:6679: checking for ANSI C header files
configure:6704: gcc -c -g -O2  conftest.c >&5
configure:6710: $? = 0
configure:6714: test -z
                         || test ! -s conftest.err
configure:6717: $? = 0
configure:6720: test -s conftest.o
configure:6723: $? = 0
configure:6809: gcc -o conftest -g -O2   conftest.c  >&5
configure:6812: $? = 0
configure:6814: ./conftest
configure:6817: $? = 0
configure:6832: result: yes
configure:6856: checking for sys/types.h
configure:6872: gcc -c -g -O2  conftest.c >&5
configure:6878: $? = 0
configure:6882: test -z
                         || test ! -s conftest.err
configure:6885: $? = 0
configure:6891: $? = 0
configure:6902: result: yes
configure:6856: checking for sys/stat.h
configure:6872: gcc -c -g -O2  conftest.c >&5
configure:6878: $? = 0
configure:6882: test -z
                         || test ! -s conftest.err
configure:6885: $? = 0
configure:6888: test -s conftest.o
configure:6891: $? = 0
configure:6902: result: yes
configure:6856: checking for stdlib.h
configure:6872: gcc -c -g -O2  conftest.c >&5
configure:6878: $? = 0
configure:6882: test -z
                         || test ! -s conftest.err
configure:6885: $? = 0
configure:6888: test -s conftest.o
configure:6891: $? = 0
configure:6902: result: yes
configure:6856: checking for string.h
configure:6872: gcc -c -g -O2  conftest.c >&5
configure:6878: $? = 0
configure:6882: test -z
                         || test ! -s conftest.err
configure:6885: $? = 0
configure:6888: test -s conftest.o
configure:6891: $? = 0
configure:6902: result: yes
configure:6856: checking for memory.h
configure:6872: gcc -c -g -O2  conftest.c >&5
configure:6878: $? = 0
configure:6882: test -z
                         || test ! -s conftest.err
configure:6885: $? = 0
configure:6888: test -s conftest.o
configure:6891: $? = 0
configure:6902: result: yes
configure:6856: checking for strings.h
configure:6872: gcc -c -g -O2  conftest.c >&5
configure:6878: $? = 0
configure:6882: test -z
                         || test ! -s conftest.err
configure:6885: $? = 0
configure:6888: test -s conftest.o
configure:6891: $? = 0
configure:6902: result: yes
configure:6856: checking for inttypes.h
configure:6872: gcc -c -g -O2  conftest.c >&5
configure:6878: $? = 0
configure:6882: test -z
                         || test ! -s conftest.err
configure:6885: $? = 0
configure:6888: test -s conftest.o
configure:6891: $? = 0
configure:6902: result: yes
configure:6856: checking for stdint.h
configure:6872: gcc -c -g -O2  conftest.c >&5
configure:6878: $? = 0
configure:6882: test -z
                         || test ! -s conftest.err
configure:6885: $? = 0
configure:6888: test -s conftest.o
configure:6891: $? = 0
configure:6902: result: yes
configure:6856: checking for unistd.h
configure:6872: gcc -c -g -O2  conftest.c >&5
configure:6878: $? = 0
configure:6882: test -z
                         || test ! -s conftest.err
configure:6885: $? = 0
configure:6888: test -s conftest.o
configure:6891: $? = 0
configure:6902: result: yes
configure:6914: checking for long double
configure:6938: gcc -c -g -O2  conftest.c >&5
configure:6944: $? = 0
configure:6948: test -z
                         || test ! -s conftest.err
configure:6951: $? = 0
configure:6954: test -s conftest.o
configure:6957: $? = 0
configure:6968: result: yes
configure:6971: checking size of long double
configure:7290: gcc -o conftest -g -O2   conftest.c  >&5
configure:7293: $? = 0
configure:7295: ./conftest
configure:7298: $? = 0
configure:7321: result: 12
configure:7350: result: running configure fragment for sysdeps/i386/elf
configure:7350: result: running configure fragment for sysdeps/unix/sysv/linux
configure:25: checking for egrep
configure:35: result: grep -E
configure:40: checking installed Linux kernel header files
configure:66: result: 2.0.10 or later

## ---------------- ##
## Cache variables. ##
## ---------------- ##

ac_cv_build=i686-pc-linux-gnu
ac_cv_build_alias=i686-pc-linux-gnu
ac_cv_c_compiler_gnu=yes
ac_cv_cxx_compiler_gnu=yes
ac_cv_env_CC_set=
ac_cv_env_CC_value=
ac_cv_env_CFLAGS_set=
ac_cv_env_CFLAGS_value=
ac_cv_env_CPPFLAGS_set=
ac_cv_env_CPPFLAGS_value=
ac_cv_env_CPP_set=
ac_cv_env_CPP_value=
ac_cv_env_CXXFLAGS_set=
ac_cv_env_CXXFLAGS_value=
ac_cv_env_CXX_set=
ac_cv_env_CXX_value=
ac_cv_env_LDFLAGS_set=
ac_cv_env_LDFLAGS_value=
ac_cv_env_build_alias_set=
ac_cv_env_build_alias_value=
ac_cv_env_host_alias_set=
ac_cv_env_host_alias_value=
ac_cv_env_target_alias_set=
ac_cv_env_target_alias_value=
ac_cv_header_inttypes_h=yes
ac_cv_header_memory_h=yes
ac_cv_header_stdc=yes
ac_cv_header_stdint_h=yes
ac_cv_header_stdlib_h=yes
ac_cv_header_string_h=yes
ac_cv_header_strings_h=yes
ac_cv_header_sys_stat_h=yes
ac_cv_header_sys_types_h=yes
ac_cv_header_unistd_h=yes
ac_cv_host=i686-pc-linux-gnu
ac_cv_host_alias=i686-pc-linux-gnu
ac_cv_objext=o
ac_cv_path_BASH=/bin/sh
ac_cv_path_BISON=/usr/bin/bison
ac_cv_path_INSTALL_INFO=/sbin/install-info
ac_cv_path_PERL=/usr/bin/perl
ac_cv_path_PWD_P=/bin/pwd
ac_cv_path_install='/usr/bin/install -c'
ac_cv_prog_AS=as
ac_cv_prog_AUTOCONF=autoconf
ac_cv_prog_AWK=gawk
ac_cv_prog_CC=gcc
ac_cv_prog_CPP='gcc -E'
ac_cv_prog_LD=ld
ac_cv_prog_MAKE=gmake
ac_cv_prog_MAKEINFO=makeinfo
ac_cv_prog_MSGFMT=msgfmt
ac_cv_prog_SED=sed
ac_cv_prog_ac_ct_CC=gcc
ac_cv_prog_ac_ct_CXX=g++
ac_cv_prog_ac_ct_RANLIB=ranlib
ac_cv_prog_cc_g=yes
ac_cv_prog_cc_stdc=
ac_cv_prog_cxx_g=yes
ac_cv_prog_egrep='grep -E'
ac_cv_sizeof_long_double=12
ac_cv_type_long_double=yes
libc_cv_Bgroup=yes
libc_cv_as_needed=no
libc_cv_as_noexecstack=no
libc_cv_asm_cfi_directives=no
libc_cv_asm_global_directive=.globl
libc_cv_asm_previous_directive=yes
libc_cv_asm_protected_directive=yes
libc_cv_asm_set_directive=yes
libc_cv_asm_symver_directive=yes
libc_cv_asm_type_prefix=@
libc_cv_asm_underscores=no
libc_cv_asm_weak_directive=yes
libc_cv_autoconf_works=yes
libc_cv_broken_alias_attribute=no
libc_cv_broken_visibility_attribute=no
libc_cv_cc_with_libunwind=no
libc_cv_cpp_asm_debuginfo=yes
libc_cv_dot_text=.text
libc_cv_fno_unit_at_a_time=yes
libc_cv_fpie=yes
libc_cv_friendly_stddef=yes
libc_cv_gcc___thread=yes
libc_cv_gcc_builtin_expect=yes
libc_cv_gcc_builtin_memset=no
libc_cv_gcc_builtin_redirection=yes
libc_cv_gcc_dwarf2_unwind_info=no_registry_needed
libc_cv_gcc_exceptions=yes
libc_cv_gcc_static_libgcc=-static-libgcc
libc_cv_gcc_subtract_local_labels=yes
libc_cv_gcc_tls_model_attr=yes
libc_cv_gcc_unwind_find_fde=yes
libc_cv_have_bash2=yes
libc_cv_have_ksh=yes
libc_cv_have_sdata_section=no
libc_cv_have_section_quotes=no
libc_cv_idn=no
libc_cv_initfinit_array=yes
libc_cv_ld_no_whole_archive=yes
libc_cv_ld_version_script_option=yes
libc_cv_libgcc_s_suffix=
libc_cv_linux2010='2.0.10 or later'
libc_cv_need_minus_P=no
libc_cv_prog_as_gnu=yes
libc_cv_prog_ld_gnu=yes
libc_cv_ranlib_necessary=no
libc_cv_signed_size_t=no
libc_cv_sysconfdir='${prefix}/etc'
libc_cv_visibility_attribute=yes
libc_cv_weak_symbols=yes
libc_cv_z_combreloc=yes
libc_cv_z_execstack=yes
libc_cv_z_initfirst=yes
libc_cv_z_nodelete=yes
libc_cv_z_nodlopen=yes
libc_cv_z_relro=no

## ----------------- ##
## Output variables. ##
## ----------------- ##

AR='ar'
AS='as'
ASFLAGS_config=''
AUTOCONF='autoconf'
AWK='gawk'
BASH='/bin/sh'
BISON='/usr/bin/bison'
BUILD_CC=''
:BUILD_CC=''
CC='gcc'
CFLAGS='-g -O2'
CPP='gcc -E'
CPPFLAGS=''
CXX='g++'
CXXFLAGS='-g -O2'
DEFINES=''
DEFS=''
ECHO_C=''
ECHO_N='-n'
ECHO_T=''
EGREP='grep -E'
INSTALL_DATA='${INSTALL} -m 644'
INSTALL_INFO='/sbin/install-info'
INSTALL_PROGRAM='${INSTALL}'
INSTALL_SCRIPT='${INSTALL}'
KSH='/bin/sh'
LD='ld'
LDFLAGS=''
LIBGD='no'
LIBOBJS=''
LIBS=''
LN_S='ln -s'
LTLIBOBJS=''
MAKE='gmake'
MAKEINFO='makeinfo'
MIG=''
MSGFMT='msgfmt'
OBJDUMP='objdump'
OBJEXT='o'
PACKAGE_BUGREPORT='glibc'
PACKAGE_NAME='GNU C Library'
PACKAGE_STRING='GNU C Library (see version.h)'
PACKAGE_TARNAME='c-library'
PACKAGE_VERSION='(see version.h)'
PATH_SEPARATOR=':'
PERL='/usr/bin/perl'
PWD_P='/bin/pwd'
RANLIB=':'
RELEASE=''
SED='sed'
SHELL='/bin/sh'
SYSINCLUDES='-I /lib/modules/2.4.20-8smp/build/include'
VERSION=''
VERSIONING='yes'
ac_ct_CC='gcc'ac_ct_CXX='g++'
ac_ct_RANLIB='ranlib'
all_warnings=''
base_machine='i386'
bindir='${exec_prefix}/bin'
bindnow='no'
bounded='no'
build='i686-pc-linux-gnu'
build_alias=''
build_cpu='i686'
build_os='linux-gnu'
build_vendor='pc'
cross_compiling='no'
datadir='${prefix}/share'
elf='yes'
enable_check_abi='no'
exceptions='-fexceptions'
exec_prefix='NONE'
fno_unit_at_a_time='-fno-unit-at-a-time'
force_install='yes'
gnu_as='yes'
gnu_ld='yes'
host='i686-pc-linux-gnu'
host_alias=''
host_cpu='i686'
host_os='linux-gnu'
host_vendor='pc'
includedir='${prefix}/include'
infodir='${prefix}/info'
ldd_rewrite_script='no'
libc_cv_Bgroup='yes'
libc_cv_as_needed='no'
libc_cv_asm_protected_directive='yes'
libc_cv_cc_with_libunwind='no'
libc_cv_cpp_asm_debuginfo='yes'
libc_cv_forced_unwind=''
libc_cv_fpie='yes'
libc_cv_gcc_static_libgcc='-static-libgcc'
libc_cv_gcc_unwind_find_fde='yes'
libc_cv_have_bash2='yes'
libc_cv_have_initfini=''
libc_cv_have_ksh='yes'
libc_cv_initfinit_array='yes'
libc_cv_libgcc_s_suffix=''
libc_cv_localedir=''
libc_cv_rootsbindir=''
libc_cv_slibdir=''
libc_cv_sysconfdir='${prefix}/etc'
libc_cv_z_combreloc='yes'
libc_cv_z_execstack='yes'
libc_cv_z_initfirst='yes'
libc_cv_z_nodelete='yes'
libc_cv_z_nodlopen='yes'
libc_cv_z_relro='no'
libdir='${exec_prefix}/lib'
libexecdir='${exec_prefix}/libexec'
linux_doors=''
localstatedir='${prefix}/var'
mach_interface_list=''
mandir='${prefix}/man'
no_whole_archive='-Wl,--no-whole-archive'
nopic_initfini=''
old_glibc_headers=''
oldest_abi='default'
oldincludedir='/usr/include'
omitfp='no'
pic_default=''
prefix='NONE'
profile='yes'
program_transform_name='s,x,x,'
sbindir='${exec_prefix}/sbin'
shared='default'
sharedstatedir='${prefix}/com'
sizeof_long_double='12'
static='yes'
static_nss='no'
subdirs='  '
sysconfdir='${prefix}/etc'
sysnames=' sysdeps/i386/elf sysdeps/unix/sysv/linux/i386
sysdeps/unix/sysv/linux sysdeps/gnu sysdeps/unix/common
sysdeps/unix/mman sysdeps/uni
x/inet sysdeps/unix/sysv/i386 sysdeps/unix/sysv sysdeps/unix/i386
sysdeps/unix sysdeps/posix sysdeps/i386/i686/fpu sysdeps/i386/i686
sysdeps/i
386/i486 sysdeps/i386/fpu sysdeps/i386 sysdeps/wordsize-32
sysdeps/ieee754/ldbl-96 sysdeps/ieee754/dbl-64 sysdeps/ieee754/flt-32
sysdeps/ieee7
54 sysdeps/generic/elf sysdeps/generic'
target_alias=''
uname_release=''
uname_sysname=''
uname_version=''
use_ldconfig='no'
with_cvs='yes'
with_fp='yes'
xcoff='no'

## ----------- ##
## confdefs.h. ##
## ----------- ##

#define ASM_GLOBAL_DIRECTIVE .globl
#define ASM_TYPE_DIRECTIVE_PREFIX @
#define DO_VERSIONING 1
#define HAVE_ASM_PREVIOUS_DIRECTIVE 1
#define HAVE_ASM_SET_DIRECTIVE 1
#define HAVE_ASM_WEAK_DIRECTIVE 1
#define HAVE_BUILTIN_EXPECT 1
#define HAVE_BUILTIN_REDIRECTION 1
#define HAVE_CPP_ASM_DEBUGINFO 1
#define HAVE_HIDDEN 1
#define HAVE_INITFINI_ARRAY 1
#define HAVE_INTTYPES_H 1
#define HAVE_MEMORY_H 1
#define HAVE_PROTECTED 1
#define HAVE_STDINT_H 1
#define HAVE_STDLIB_H 1
#define HAVE_STRINGS_H 1
#define HAVE_STRING_H 1
#define HAVE_SUBTRACT_LOCAL_LABELS 1
#define HAVE_SYS_STAT_H 1
#define HAVE_SYS_TYPES_H 1
#define HAVE_TLS_MODEL_ATTRIBUTE 1
#define HAVE_UNISTD_H 1
#define HAVE_VISIBILITY_ATTRIBUTE 1
#define HAVE_Z_COMBRELOC 1
#define HAVE___THREAD 1
#define NO_UNDERSCORES 1
#define PACKAGE_BUGREPORT "glibc"
#define PACKAGE_NAME "GNU C Library"
#define PACKAGE_STRING "GNU C Library (see version.h)"
#define PACKAGE_TARNAME "c-library"
#define PACKAGE_VERSION "(see version.h)"
#define PI_STATIC_AND_HIDDEN 1
#define SIZEOF_LONG_DOUBLE 12
#define STDC_HEADERS 1
#define USE_REGPARMS 1
#endif
#ifdef __cplusplus
extern "C" void std::exit (int) throw (); using std::exit;

configure: exit 1



More information about the lfs-support mailing list