Automake 1.10 make check error section 6.27 LFS 6.3

Dan Nicholson dbn.lists at
Tue Apr 8 12:39:55 PDT 2008

On Tue, Apr 8, 2008 at 12:13 PM, abolinder at
<abolinder at> wrote:
>  I get this error running make check
>  1 of 566 tests failed
>  (38 tests were not run)
>  *** [check-TESTS] Error 1
>  Leaving directory /sources/autoconf-1.10/tests
>  *** [check-am] Error 2
>  Leaving directory /sources/autoconf-1.10/tests
>  *** [check-recursive] Error 1
>  i cant figure out how to solve it by my it safe to ignore it and
>  continue with building the rest of the system. or can anyone point me in the
>  right direction of finding whats wrong?

I'd just continue since you probably won't even use automake. However,
I can't see what would be wrong since we can't see what test failed.
If you can grep the log for "FAIL" or "fail", you'll probably see
which test failed in particular.


More information about the lfs-support mailing list