[lfs-support] glibc tests errors

mais lfs maislfs at gmail.com
Mon Jan 2 08:13:55 PST 2012


I don't know how to proceed, I get the following errors
when running: make -k check 2>&1 | tee glibc-check-log

root:/sources/glibc-build# grep Error glibc-check-log
make[1]: *** [csu/tests] Error 2
make[1]: *** [iconv/tests] Error 2
make[1]: *** [locale/tests] Error 2
make[3]: *** [/sources/glibc-build/iconvdata/gconv-modules] Error 1
make[2]: *** [/sources/glibc-build/iconvdata/gconv-modules] Error 2
make[1]: *** [localedata/tests] Error 2
make[2]: *** [/sources/glibc-build/iconvdata/iso8859-7jp.stmp] Error 1
make[2]: *** [/sources/glibc-build/iconvdata/stamp.os] Error 1
make[2]: *** [/sources/glibc-build/iconvdata/stamp.oS] Error 1
make[2]: *** [/sources/glibc-build/iconvdata/gconv-modules] Error 1
make[1]: *** [iconvdata/tests] Error 2
make[1]: *** [assert/tests] Error 2
make[1]: *** [ctype/tests] Error 2
make[1]: *** [intl/tests] Error 2
make[1]: *** [catgets/tests] Error 2
make[1]: *** [math/tests] Error 2
make[1]: *** [setjmp/tests] Error 2
make[1]: *** [signal/tests] Error 2
make[2]: *** [/sources/glibc-build/stdlib/tst-putenvmod.so] Error 1
make[1]: *** [stdlib/tests] Error 2
make[1]: *** [stdio-common/tests] Error 2
make[1]: *** [libio/tests] Error 2
make[1]: *** [dlfcn/tests] Error 2
make[1]: *** [malloc/tests] Error 2
make[1]: *** [string/tests] Error 2
make[1]: *** [wcsmbs/tests] Error 2
make[1]: *** [timezone/tests] Error 2
make[1]: *** [time/tests] Error 2
make[1]: *** [dirent/tests] Error 2
make[1]: *** [grp/tests] Error 2
make[1]: *** [pwd/tests] Error 2
make[2]: [/sources/glibc-build/posix/annexc.out] Error 1 (ignored)
make[1]: *** [posix/tests] Error 2
make[1]: *** [io/tests] Error 2
make[1]: *** [resource/tests] Error 2
make[1]: *** [misc/tests] Error 2
make[1]: *** [gmon/tests] Error 2
make[1]: *** [gnulib/tests] Error 2
make[1]: *** [wctype/tests] Error 2
make[1]: *** [shadow/tests] Error 2
make[1]: *** [gshadow/tests] Error 2
make[1]: *** [argp/tests] Error 2
make[1]: *** [crypt/tests] Error 2
make[1]: *** [nptl/tests] Error 2
make[1]: *** [resolv/tests] Error 2
make[1]: *** [nss/tests] Error 2
make[1]: *** [rt/tests] Error 2
make[1]: *** [debug/tests] Error 2
make[2]: *** [/sources/glibc-build/nptl_db/db-symbols.v.i] Error 1
make[1]: *** [nptl_db/tests] Error 2
make[1]: *** [inet/tests] Error 2
make[1]: *** [sunrpc/tests] Error 2
make[1]: *** [login/tests] Error 2
make[2]: *** [/sources/glibc-build/dlfcn/libdl.so] Error 1
make[2]: *** [/sources/glibc-build/nptl/libpthread.so] Error 1
make[2]: *** [/sources/glibc-build/math/libm.so] Error 1
make[2]: *** [/sources/glibc-build/rt/librt.so] Error 1
make[2]: *** [/sources/glibc-build/resolv/libresolv.so] Error 1
make[2]: *** [/sources/glibc-build/crypt/libcrypt.so] Error 1
make[1]: *** [elf/tests] Error 2
make: *** [check] Error 2

These are way more than the few mentioned in the book.
thx
-------------- next part --------------
An HTML attachment was scrubbed...
URL: <http://lists.linuxfromscratch.org/pipermail/lfs-support/attachments/20120102/ed888897/attachment.html>


More information about the lfs-support mailing list